Build: #3 failed Manual run by Kris De Volder

Test results

  • 1,157 tests in total
  • 2 tests failed
  • 2 failures are new
  • 4 tests were quarantined / skipped
  • 60 minutes taken in total.
New test failures 2
Status Test View job Duration
Collapse Failed BootDashModelTest testAutoInstallSpringCloudCLICustom History
Default Job 25 secs
java.lang.AssertionError: null
	at org.junit.Assert.fail(Assert.java:86)
	at org.junit.Assert.assertTrue(Assert.java:41)
	at org.junit.Assert.assertFalse(Assert.java:64)
	at org.junit.Assert.assertFalse(Assert.java:74)
	at org.springframework.ide.eclipse.boot.dash.test.BootDashModelTest.testAutoInstallSpringCloudCLICustom(BootDashModelTest.java:233)
Collapse Failed BootLaunchConfigurationDelegateTest testRuntimeClasspathNoTestStuffGradle History
Default Job < 1 sec
org.eclipse.core.runtime.CoreException: FileNotFoundException: /opt/bamboo-home/xml-data/build-dir/HTTPSONLY-IDECITEST-JOB1/plugins/org.springframework.ide.eclipse.boot.launch.test/target/work/data/gradle-test-project/pom.xml (No such file or directory)
	at org.springsource.ide.eclipse.commons.livexp.util.ExceptionUtil.coreException(ExceptionUtil.java:46)
	at org.springframework.ide.eclipse.boot.test.BootProjectTestHarness.assertOk(BootProjectTestHarness.java:369)
	at org.springframework.ide.eclipse.boot.test.BootProjectTestHarness$7.test(BootProjectTestHarness.java:286)
	at org.springsource.ide.eclipse.commons.frameworks.test.util.ACondition.doTest(ACondition.java:143)
	at org.springsource.ide.eclipse.commons.frameworks.test.util.ACondition.waitFor(ACondition.java:103)
	at org.springsource.ide.eclipse.commons.frameworks.test.util.ACondition.<init>(ACondition.java:87)
	at org.springframework.ide.eclipse.boot.test.BootProjectTestHarness$7.<init>(BootProjectTestHarness.java:283)
(22 more lines...)
Skipped tests 4
Status Test Failing since View job
Skipped BootDashModelTest startOldBootApp History
Default Job
Skipped BootDashModelTest startLifeCycleDisabledApp History
Default Job
Skipped CloudFoundryBootDashModelIntegrationTest httpRouteWithPath History
Default Job
Skipped IntrospectorTest testDeclaredMethods History
Default Job