Build: #31 failed Changes by Kris De Volder

Build result summary

Details

Completed
Duration
78 minutes
Labels
None
Agent
bamboo-15.af.pivotal.io
Revision
fbf8328228802f88c80c107ca7b1ffbd3f50f1c7 fbf8328228802f88c80c107ca7b1ffbd3f50f1c7
Total tests
1159
Failing since
#30 (Changes by Martin Lippert)
Fixed in
#32 (Changes by Kris De Volder)

Responsible

Code commits

Author Commit Message Commit date
Kris De Volder Kris De Volder fbf8328228802f88c80c107ca7b1ffbd3f50f1c7 fbf8328228802f88c80c107ca7b1ffbd3f50f1c7 Add experimental test that verifies every EditStarters cross-selection of 2 starters

Tests

New test failures 2
Status Test View job Duration
Collapse Failed BootDashActionTests redebugActionEnablementForProject History
Default Job 6 secs
java.lang.AssertionError: null
	at org.junit.Assert.fail(Assert.java:86)
	at org.junit.Assert.assertTrue(Assert.java:41)
	at org.junit.Assert.assertTrue(Assert.java:52)
	at org.springframework.ide.eclipse.boot.dash.test.BootDashActionTests$20.test(BootDashActionTests.java:537)
	at org.springsource.ide.eclipse.commons.frameworks.test.util.ACondition.doTest(ACondition.java:143)
	at org.springsource.ide.eclipse.commons.frameworks.test.util.ACondition.waitFor(ACondition.java:103)
	at org.springsource.ide.eclipse.commons.frameworks.test.util.ACondition.<init>(ACondition.java:82)
(3 more lines...)
Collapse Failed CloudFoundryClientTest testApplicationLogConnection History
Default Job 58 secs
java.util.concurrent.ExecutionException: java.io.IOException: org.cloudfoundry.client.v2.ClientV2Exception: UnknownError(10001): An unknown error occurred.
	at org.springframework.ide.eclipse.boot.dash.cloudfoundry.client.v2.ReactorUtils.get(ReactorUtils.java:86)
	at org.springframework.ide.eclipse.boot.dash.cloudfoundry.client.v2.DefaultClientRequestsV2.push(DefaultClientRequestsV2.java:729)
	at org.springframework.ide.eclipse.boot.dash.test.CloudFoundryClientTest.push(CloudFoundryClientTest.java:1102)
	at org.springframework.ide.eclipse.boot.dash.test.CloudFoundryClientTest.lambda$10(CloudFoundryClientTest.java:768)
Caused by: org.cloudfoundry.client.v2.ClientV2Exception: UnknownError(10001): An unknown error occurred.
	at org.cloudfoundry.reactor.util.ErrorPayloadMapper.lambda$null$0(ErrorPayloadMapper.java:46)
	at org.cloudfoundry.reactor.util.ErrorPayloadMapper.lambda$null$9(ErrorPayloadMapper.java:98)
(51 more lines...)
Fixed tests 1
Status Test Failing since View job Duration
Successful CloudFoundryBootDashModelIntegrationTest httpRoute History
Failing since build #30 (Changes by Martin Lippert) Default Job 1 min