Build: #84 failed Changes by Kris De Volder

Build result summary

Details

Completed
Duration
101 minutes
Labels
None
Agent
bamboo-21.af.pivotal.io
Revision
043e2b0992efb2e28777582e7b46fdd4981b936a 043e2b0992efb2e28777582e7b46fdd4981b936a
Total tests
1169

Tests

Responsible

Code commits

Author Commit Message Commit date
Kris De Volder Kris De Volder 043e2b0992efb2e28777582e7b46fdd4981b936a 043e2b0992efb2e28777582e7b46fdd4981b936a Some tightening of Validator in CF target creation wizard
We hope this fixes https://www.pivotaltracker.com/story/show/170260135

Tests

New test failures 4
Status Test View job Duration
Collapse Failed EditStartersModelTest addBomWithSubsetOfRepos History
Default Job 2 mins
org.eclipse.core.runtime.CoreException: AssertionError: The wanted bootVersion '2.2.1.RELEASE'is not found in the wizard
	at org.springsource.ide.eclipse.commons.livexp.util.ExceptionUtil.coreException(ExceptionUtil.java:46)
	at org.springframework.ide.eclipse.boot.test.BootProjectTestHarness.assertOk(BootProjectTestHarness.java:371)
	at org.springframework.ide.eclipse.boot.test.BootProjectTestHarness$7.test(BootProjectTestHarness.java:288)
	at org.springsource.ide.eclipse.commons.frameworks.test.util.ACondition.doTest(ACondition.java:143)
	at org.springsource.ide.eclipse.commons.frameworks.test.util.ACondition.waitFor(ACondition.java:103)
	at org.springsource.ide.eclipse.commons.frameworks.test.util.ACondition.<init>(ACondition.java:87)
	at org.springframework.ide.eclipse.boot.test.BootProjectTestHarness$7.<init>(BootProjectTestHarness.java:285)
(10 more lines...)
Collapse Failed EditStartersModelTest addMultipleStartersWithSameBom History
Default Job 2 mins
org.eclipse.core.runtime.CoreException: AssertionError: The wanted bootVersion '2.2.1.RELEASE'is not found in the wizard
	at org.springsource.ide.eclipse.commons.livexp.util.ExceptionUtil.coreException(ExceptionUtil.java:46)
	at org.springframework.ide.eclipse.boot.test.BootProjectTestHarness.assertOk(BootProjectTestHarness.java:371)
	at org.springframework.ide.eclipse.boot.test.BootProjectTestHarness$7.test(BootProjectTestHarness.java:288)
	at org.springsource.ide.eclipse.commons.frameworks.test.util.ACondition.doTest(ACondition.java:143)
	at org.springsource.ide.eclipse.commons.frameworks.test.util.ACondition.waitFor(ACondition.java:103)
	at org.springsource.ide.eclipse.commons.frameworks.test.util.ACondition.<init>(ACondition.java:87)
	at org.springframework.ide.eclipse.boot.test.BootProjectTestHarness$7.<init>(BootProjectTestHarness.java:285)
(10 more lines...)
Collapse Failed EditStartersModelTest addDependencyWithRepo History
Default Job 2 mins
org.eclipse.core.runtime.CoreException: AssertionError: The wanted bootVersion '2.2.1.RELEASE'is not found in the wizard
	at org.springsource.ide.eclipse.commons.livexp.util.ExceptionUtil.coreException(ExceptionUtil.java:46)
	at org.springframework.ide.eclipse.boot.test.BootProjectTestHarness.assertOk(BootProjectTestHarness.java:371)
	at org.springframework.ide.eclipse.boot.test.BootProjectTestHarness$7.test(BootProjectTestHarness.java:288)
	at org.springsource.ide.eclipse.commons.frameworks.test.util.ACondition.doTest(ACondition.java:143)
	at org.springsource.ide.eclipse.commons.frameworks.test.util.ACondition.waitFor(ACondition.java:103)
	at org.springsource.ide.eclipse.commons.frameworks.test.util.ACondition.<init>(ACondition.java:87)
	at org.springframework.ide.eclipse.boot.test.BootProjectTestHarness$7.<init>(BootProjectTestHarness.java:285)
(10 more lines...)
Collapse Failed EditStartersModelTest addMultipleStartersWithDifferentBom History
Default Job 2 mins
org.eclipse.core.runtime.CoreException: AssertionError: The wanted bootVersion '2.2.1.RELEASE'is not found in the wizard
	at org.springsource.ide.eclipse.commons.livexp.util.ExceptionUtil.coreException(ExceptionUtil.java:46)
	at org.springframework.ide.eclipse.boot.test.BootProjectTestHarness.assertOk(BootProjectTestHarness.java:371)
	at org.springframework.ide.eclipse.boot.test.BootProjectTestHarness$7.test(BootProjectTestHarness.java:288)
	at org.springsource.ide.eclipse.commons.frameworks.test.util.ACondition.doTest(ACondition.java:143)
	at org.springsource.ide.eclipse.commons.frameworks.test.util.ACondition.waitFor(ACondition.java:103)
	at org.springsource.ide.eclipse.commons.frameworks.test.util.ACondition.<init>(ACondition.java:87)
	at org.springframework.ide.eclipse.boot.test.BootProjectTestHarness$7.<init>(BootProjectTestHarness.java:285)
(10 more lines...)