Build: #84 failed Changes by Kris De Volder

Test results

  • 1,169 tests in total
  • 4 tests failed
  • 4 failures are new
  • 6 tests were quarantined / skipped
  • 71 minutes taken in total.
New test failures 4
Status Test View job Duration
Collapse Failed EditStartersModelTest addBomWithSubsetOfRepos History
Default Job 2 mins
org.eclipse.core.runtime.CoreException: AssertionError: The wanted bootVersion '2.2.1.RELEASE'is not found in the wizard
	at org.springsource.ide.eclipse.commons.livexp.util.ExceptionUtil.coreException(ExceptionUtil.java:46)
	at org.springframework.ide.eclipse.boot.test.BootProjectTestHarness.assertOk(BootProjectTestHarness.java:371)
	at org.springframework.ide.eclipse.boot.test.BootProjectTestHarness$7.test(BootProjectTestHarness.java:288)
	at org.springsource.ide.eclipse.commons.frameworks.test.util.ACondition.doTest(ACondition.java:143)
	at org.springsource.ide.eclipse.commons.frameworks.test.util.ACondition.waitFor(ACondition.java:103)
	at org.springsource.ide.eclipse.commons.frameworks.test.util.ACondition.<init>(ACondition.java:87)
	at org.springframework.ide.eclipse.boot.test.BootProjectTestHarness$7.<init>(BootProjectTestHarness.java:285)
(10 more lines...)
Collapse Failed EditStartersModelTest addMultipleStartersWithSameBom History
Default Job 2 mins
org.eclipse.core.runtime.CoreException: AssertionError: The wanted bootVersion '2.2.1.RELEASE'is not found in the wizard
	at org.springsource.ide.eclipse.commons.livexp.util.ExceptionUtil.coreException(ExceptionUtil.java:46)
	at org.springframework.ide.eclipse.boot.test.BootProjectTestHarness.assertOk(BootProjectTestHarness.java:371)
	at org.springframework.ide.eclipse.boot.test.BootProjectTestHarness$7.test(BootProjectTestHarness.java:288)
	at org.springsource.ide.eclipse.commons.frameworks.test.util.ACondition.doTest(ACondition.java:143)
	at org.springsource.ide.eclipse.commons.frameworks.test.util.ACondition.waitFor(ACondition.java:103)
	at org.springsource.ide.eclipse.commons.frameworks.test.util.ACondition.<init>(ACondition.java:87)
	at org.springframework.ide.eclipse.boot.test.BootProjectTestHarness$7.<init>(BootProjectTestHarness.java:285)
(10 more lines...)
Collapse Failed EditStartersModelTest addDependencyWithRepo History
Default Job 2 mins
org.eclipse.core.runtime.CoreException: AssertionError: The wanted bootVersion '2.2.1.RELEASE'is not found in the wizard
	at org.springsource.ide.eclipse.commons.livexp.util.ExceptionUtil.coreException(ExceptionUtil.java:46)
	at org.springframework.ide.eclipse.boot.test.BootProjectTestHarness.assertOk(BootProjectTestHarness.java:371)
	at org.springframework.ide.eclipse.boot.test.BootProjectTestHarness$7.test(BootProjectTestHarness.java:288)
	at org.springsource.ide.eclipse.commons.frameworks.test.util.ACondition.doTest(ACondition.java:143)
	at org.springsource.ide.eclipse.commons.frameworks.test.util.ACondition.waitFor(ACondition.java:103)
	at org.springsource.ide.eclipse.commons.frameworks.test.util.ACondition.<init>(ACondition.java:87)
	at org.springframework.ide.eclipse.boot.test.BootProjectTestHarness$7.<init>(BootProjectTestHarness.java:285)
(10 more lines...)
Collapse Failed EditStartersModelTest addMultipleStartersWithDifferentBom History
Default Job 2 mins
org.eclipse.core.runtime.CoreException: AssertionError: The wanted bootVersion '2.2.1.RELEASE'is not found in the wizard
	at org.springsource.ide.eclipse.commons.livexp.util.ExceptionUtil.coreException(ExceptionUtil.java:46)
	at org.springframework.ide.eclipse.boot.test.BootProjectTestHarness.assertOk(BootProjectTestHarness.java:371)
	at org.springframework.ide.eclipse.boot.test.BootProjectTestHarness$7.test(BootProjectTestHarness.java:288)
	at org.springsource.ide.eclipse.commons.frameworks.test.util.ACondition.doTest(ACondition.java:143)
	at org.springsource.ide.eclipse.commons.frameworks.test.util.ACondition.waitFor(ACondition.java:103)
	at org.springsource.ide.eclipse.commons.frameworks.test.util.ACondition.<init>(ACondition.java:87)
	at org.springframework.ide.eclipse.boot.test.BootProjectTestHarness$7.<init>(BootProjectTestHarness.java:285)
(10 more lines...)
Skipped tests 6
Status Test Failing since View job
Skipped BootDashModelTest startLifeCycleDisabledApp History
Default Job
Skipped BootDashModelTest startOldBootApp History
Default Job
Skipped CloudFoundryBootDashModelIntegrationTest httpRouteWithPath History
Default Job
Skipped EditStartersModelTest isolatedDependencies History
Default Job
Skipped EditStartersModelTest exhaustiveCrossSelectionTest History
Default Job
Skipped IntrospectorTest testDeclaredMethods History
Default Job