Build: #15 failed

Job: Default Job failed

Stages & jobs

  1. Default Stage

Job result summary

Completed
Duration
110 minutes
Agent
bamboo-21.af.pivotal.io
Revision
d74349ca5f630ffc14f9ebc30ed8e71775e25366 d74349ca5f630ffc14f9ebc30ed8e71775e25366
Total tests
1157
Failing since
#1 (First build for this plan – )
Fixed in
#23 (Code changes detected)

Tests

  • 1,157 tests in total
  • 2 tests failed
  • 2 failures are new
  • 4 tests were quarantined / skipped
  • 72 minutes taken in total.
New test failures 2
Status Test Duration
Collapse Failed BootDashModelTest testAutoInstallSpringCloudCLICustom History
3 secs
java.lang.AssertionError: null
	at org.junit.Assert.fail(Assert.java:86)
	at org.junit.Assert.assertTrue(Assert.java:41)
	at org.junit.Assert.assertFalse(Assert.java:64)
	at org.junit.Assert.assertFalse(Assert.java:74)
	at org.springframework.ide.eclipse.boot.dash.test.BootDashModelTest.testAutoInstallSpringCloudCLICustom(BootDashModelTest.java:233)
Collapse Failed BootLaunchConfigurationDelegateTest testRuntimeClasspathNoTestStuffGradle History
< 1 sec
org.eclipse.core.runtime.CoreException: FileNotFoundException: /opt/bamboo-home/xml-data/build-dir/HTTPSONLY-IDECITEST-JOB1/plugins/org.springframework.ide.eclipse.boot.launch.test/target/work/data/gradle-test-project/pom.xml (No such file or directory)
	at org.springsource.ide.eclipse.commons.livexp.util.ExceptionUtil.coreException(ExceptionUtil.java:46)
	at org.springframework.ide.eclipse.boot.test.BootProjectTestHarness.assertOk(BootProjectTestHarness.java:369)
	at org.springframework.ide.eclipse.boot.test.BootProjectTestHarness$7.test(BootProjectTestHarness.java:286)
	at org.springsource.ide.eclipse.commons.frameworks.test.util.ACondition.doTest(ACondition.java:143)
	at org.springsource.ide.eclipse.commons.frameworks.test.util.ACondition.waitFor(ACondition.java:103)
	at org.springsource.ide.eclipse.commons.frameworks.test.util.ACondition.<init>(ACondition.java:87)
	at org.springframework.ide.eclipse.boot.test.BootProjectTestHarness$7.<init>(BootProjectTestHarness.java:283)
(22 more lines...)

Error summary

The build generated some errors. See the full build log for more details.

  org.junit.internal.runners.JUnit38ClassRunner.run(JUnit38ClassRunner.java:86)
  org.junit.runners.Suite.runChild(Suite.java:128)
  org.junit.runners.Suite.runChild(Suite.java:27)
  org.junit.runners.ParentRunner$3.run(ParentRunner.java:290)
  org.junit.runners.ParentRunner$1.schedule(ParentRunner.java:71)
  org.junit.runners.ParentRunner.runChildren(ParentRunner.java:288)
  org.junit.runners.ParentRunner.access$000(ParentRunner.java:58)
  org.junit.runners.ParentRunner$2.evaluate(ParentRunner.java:268)
  org.junit.runners.ParentRunner.run(ParentRunner.java:363)
  org.apache.maven.surefire.junit4.JUnit4Provider.execute(JUnit4Provider.java:264)
  org.apache.maven.surefire.junit4.JUnit4Provider.executeTestSet(JUnit4Provider.java:153)
  org.apache.maven.surefire.junit4.JUnit4Provider.invoke(JUnit4Provider.java:124)
  sun.reflect.NativeMethodAccessorImpl.invoke0(Native Method)
  sun.reflect.NativeMethodAccessorImpl.invoke(NativeMethodAccessorImpl.java:62)
  sun.reflect.DelegatingMethodAccessorImpl.invoke(DelegatingMethodAccessorImpl.java:43)
  java.lang.reflect.Method.invoke(Method.java:498)
  org.apache.maven.surefire.util.ReflectionUtils.invokeMethodWithArray2(ReflectionUtils.java:208)
  org.apache.maven.surefire.booter.ProviderFactory$ProviderProxy.invoke(ProviderFactory.java:156)
  org.apache.maven.surefire.booter.ProviderFactory.invokeProvider(ProviderFactory.java:82)
  org.eclipse.tycho.surefire.osgibooter.OsgiSurefireBooter.run(OsgiSurefireBooter.java:91)
  org.eclipse.tycho.surefire.osgibooter.AbstractUITestApplication$1.run(AbstractUITestApplication.java:35)
  org.eclipse.swt.widgets.RunnableLock.run(RunnableLock.java:40)
  org.eclipse.swt.widgets.Synchronizer.runAsyncMessages(Synchronizer.java:185)
  org.eclipse.swt.widgets.Display.runAsyncMessages(Display.java:5026)
  org.eclipse.swt.widgets.Display.readAndDispatch(Display.java:4582)
  org.eclipse.e4.ui.internal.workbench.swt.PartRenderingEngine$5.run(PartRenderingEngine.java:1173)
  org.eclipse.core.databinding.observable.Realm.runWithDefault(Realm.java:338)
  org.eclipse.e4.ui.internal.workbench.swt.PartRenderingEngine.run(PartRenderingEngine.java:1062)
  org.eclipse.e4.ui.internal.workbench.E4Workbench.createAndRunUI(E4Workbench.java:155)
  org.eclipse.ui.internal.Workbench.lambda$3(Workbench.java:644)
  org.eclipse.ui.internal.Workbench$$Lambda$27/1903051549.run(Unknown Source)
  org.eclipse.core.databinding.observable.Realm.runWithDefault(Realm.java:338)
  org.eclipse.ui.internal.Workbench.createAndRunWorkbench(Workbench.java:566)
  org.eclipse.ui.PlatformUI.createAndRunWorkbench(PlatformUI.java:150)
  org.eclipse.ui.internal.ide.application.IDEApplication.start(IDEApplication.java:155)
  org.eclipse.tycho.surefire.osgibooter.UITestApplication.runApplication(UITestApplication.java:31)
  org.eclipse.tycho.surefire.osgibooter.AbstractUITestApplication.run(AbstractUITestApplication.java:120)
  org.eclipse.tycho.surefire.osgibooter.UITestApplication.start(UITestApplication.java:37)
  org.eclipse.equinox.internal.app.EclipseAppHandle.run(EclipseAppHandle.java:203)
  org.eclipse.core.runtime.internal.adaptor.EclipseAppLauncher.runApplication(EclipseAppLauncher.java:137)
  org.eclipse.core.runtime.internal.adaptor.EclipseAppLauncher.start(EclipseAppLauncher.java:107)
  org.eclipse.core.runtime.adaptor.EclipseStarter.run(EclipseStarter.java:400)
  org.eclipse.core.runtime.adaptor.EclipseStarter.run(EclipseStarter.java:255)
  sun.reflect.NativeMethodAccessorImpl.invoke0(Native Method)
  sun.reflect.NativeMethodAccessorImpl.invoke(NativeMethodAccessorImpl.java:62)
  sun.reflect.DelegatingMethodAccessorImpl.invoke(DelegatingMethodAccessorImpl.java:43)
  java.lang.reflect.Method.invoke(Method.java:498)
  org.eclipse.equinox.launcher.Main.invokeFramework(Main.java:661)
  org.eclipse.equinox.launcher.Main.basicRun(Main.java:597)
  org.eclipse.equinox.launcher.Main.run(Main.java:1476)
  org.eclipse.equinox.launcher.Main.main(Main.java:1449)

Thread[Signal Dispatcher,9,system]


OpenJDK 64-Bit Server VM warning: ignoring option MaxPermSize=256m; support was removed in 8.0

(SWT:31942): Gtk-WARNING **: 20:58:35.491: gtk_widget_size_allocate(): attempt to allocate widget with width -3 and height -3
SLF4J: Failed to load class "org.slf4j.impl.StaticLoggerBinder".
SLF4J: Defaulting to no-operation (NOP) logger implementation
SLF4J: See http://www.slf4j.org/codes.html#StaticLoggerBinder for further details.
OpenJDK 64-Bit Server VM warning: ignoring option MaxPermSize=256m; support was removed in 8.0
log4j:WARN No appenders could be found for logger (org.springframework.core.io.support.PathMatchingResourcePatternResolver).
log4j:WARN Please initialize the log4j system properly.
OpenJDK 64-Bit Server VM warning: ignoring option MaxPermSize=256m; support was removed in 8.0
OpenJDK 64-Bit Server VM warning: ignoring option MaxPermSize=256m; support was removed in 8.0
Forcing manual proxy configuration
System: Linux 4.15.0-50-generic (amd64) / linux-x86_64-gtk / AdoptOpenJDK OpenJDK 64-Bit Server VM 1.8.0_212
Proxy : null (Platform) / [DIRECT] (Java)

Running testMarkerCreated(org.springframework.ide.eclipse.bestpractices.tests.ruletests.ImportElementsAtTopRuleTest)
Running testMarkerNotCreated(org.springframework.ide.eclipse.bestpractices.tests.ruletests.ImportElementsAtTopRuleTest)
Running testMarkerCreated(org.springframework.ide.eclipse.bestpractices.tests.ruletests.ParentBeanSpecifiesAbstractClassRuleTest)
Running testMarkerNotCreated(org.springframework.ide.eclipse.bestpractices.tests.ruletests.ParentBeanSpecifiesAbstractClassRuleTest)
Running testMarkerCreated(org.springframework.ide.eclipse.bestpractices.tests.ruletests.TooManyBeansInFileRuleTest)
Running testMarkerNotCreated(org.springframework.ide.eclipse.bestpractices.tests.ruletests.TooManyBeansInFileRuleTest)
Running testMarkerCreated(org.springframework.ide.eclipse.bestpractices.tests.ruletests.RefElementRuleTest)
Running testMarkerNotCreated(org.springframework.ide.eclipse.bestpractices.tests.ruletests.RefElementRuleTest)
Running testMarkerCreated(org.springframework.ide.eclipse.bestpractices.tests.ruletests.UnnecessaryValueElementRuleTest)
Running testMarkerNotCreated(org.springframework.ide.eclipse.bestpractices.tests.ruletests.UnnecessaryValueElementRuleTest)
Running testMarkerCreated(org.springframework.ide.eclipse.bestpractices.tests.ruletests.UseBeanInheritanceRuleTest)
Running testMarkerNotCreated1(org.springframework.ide.eclipse.bestpractices.tests.ruletests.UseBeanInheritanceRuleTest)
Running testMarkerNotCreated2(org.springframework.ide.eclipse.bestpractices.tests.ruletests.UseBeanInheritanceRuleTest)
Running testMarkerNotCreated3(org.springframework.ide.eclipse.bestpractices.tests.ruletests.UseBeanInheritanceRuleTest)
Running testMarkerNotCreated4(org.springframework.ide.eclipse.bestpractices.tests.ruletests.UseBeanInheritanceRuleTest)
Running testMarkerNotCreated5(org.springframework.ide.eclipse.bestpractices.tests.ruletests.UseBeanInheritanceRuleTest)
Running testMarkerCreated(org.springframework.ide.eclipse.bestpractices.tests.ruletests.AvoidDriverManagerDataSourceRuleTest)
Running testMarkerNotCreated(org.springframework.ide.eclipse.bestpractices.tests.ruletests.AvoidDriverManagerDataSourceRuleTest)
Running testMarkerCreated(org.springframework.ide.eclipse.bestpractices.tests.ruletests.UseDedicatedNamespacesRuleTest)
Running testMarkerNotCreated(org.springframework.ide.eclipse.bestpractices.tests.ruletests.UseDedicatedNamespacesRuleTest)

Failures:

Errors:

0 out of 20 tests failed
Running ShutdownWatchdog
OpenJDK 64-Bit Server VM warning: ignoring option MaxPermSize=256m; support was removed in 8.0
log4j:WARN No appenders could be found for logger (org.springframework.beans.CachedIntrospectionResults).
log4j:WARN Please initialize the log4j system properly.