Build: #16 failed

Job: Default Job failed

Stages & jobs

  1. Default Stage

Job result summary

Completed
Duration
99 minutes
Agent
bamboo-24.af.pivotal.io
Revision
b0ef99241a67c835d2654b7711ec1e7b3fbb8942 b0ef99241a67c835d2654b7711ec1e7b3fbb8942
Total tests
1157
Failing since
#1 (First build for this plan – )
Fixed in
#23 (Code changes detected)

Tests

  • 1,157 tests in total
  • 2 tests failed
  • 4 tests were quarantined / skipped
  • 60 minutes taken in total.
Existing test failures 2
Status Test Failing since Duration
java.lang.AssertionError: null
	at org.junit.Assert.fail(Assert.java:86)
	at org.junit.Assert.assertTrue(Assert.java:41)
	at org.junit.Assert.assertFalse(Assert.java:64)
	at org.junit.Assert.assertFalse(Assert.java:74)
	at org.springframework.ide.eclipse.boot.dash.test.BootDashModelTest.testAutoInstallSpringCloudCLICustom(BootDashModelTest.java:233)
org.eclipse.core.runtime.CoreException: FileNotFoundException: /opt/bamboo-home/xml-data/build-dir/HTTPSONLY-IDECITEST-JOB1/plugins/org.springframework.ide.eclipse.boot.launch.test/target/work/data/gradle-test-project/pom.xml (No such file or directory)
	at org.springsource.ide.eclipse.commons.livexp.util.ExceptionUtil.coreException(ExceptionUtil.java:46)
	at org.springframework.ide.eclipse.boot.test.BootProjectTestHarness.assertOk(BootProjectTestHarness.java:369)
	at org.springframework.ide.eclipse.boot.test.BootProjectTestHarness$7.test(BootProjectTestHarness.java:286)
	at org.springsource.ide.eclipse.commons.frameworks.test.util.ACondition.doTest(ACondition.java:143)
	at org.springsource.ide.eclipse.commons.frameworks.test.util.ACondition.waitFor(ACondition.java:103)
	at org.springsource.ide.eclipse.commons.frameworks.test.util.ACondition.<init>(ACondition.java:87)
	at org.springframework.ide.eclipse.boot.test.BootProjectTestHarness$7.<init>(BootProjectTestHarness.java:283)
(22 more lines...)

Error summary

The build generated some errors. See the full build log for more details.

  org.eclipse.core.databinding.observable.Realm.runWithDefault(Realm.java:338)
  org.eclipse.e4.ui.internal.workbench.swt.PartRenderingEngine.run(PartRenderingEngine.java:1062)
  org.eclipse.e4.ui.internal.workbench.E4Workbench.createAndRunUI(E4Workbench.java:155)
  org.eclipse.ui.internal.Workbench.lambda$3(Workbench.java:644)
  org.eclipse.ui.internal.Workbench$$Lambda$27/1903051549.run(Unknown Source)
  org.eclipse.core.databinding.observable.Realm.runWithDefault(Realm.java:338)
  org.eclipse.ui.internal.Workbench.createAndRunWorkbench(Workbench.java:566)
  org.eclipse.ui.PlatformUI.createAndRunWorkbench(PlatformUI.java:150)
  org.eclipse.ui.internal.ide.application.IDEApplication.start(IDEApplication.java:155)
  org.eclipse.tycho.surefire.osgibooter.UITestApplication.runApplication(UITestApplication.java:31)
  org.eclipse.tycho.surefire.osgibooter.AbstractUITestApplication.run(AbstractUITestApplication.java:120)
  org.eclipse.tycho.surefire.osgibooter.UITestApplication.start(UITestApplication.java:37)
  org.eclipse.equinox.internal.app.EclipseAppHandle.run(EclipseAppHandle.java:203)
  org.eclipse.core.runtime.internal.adaptor.EclipseAppLauncher.runApplication(EclipseAppLauncher.java:137)
  org.eclipse.core.runtime.internal.adaptor.EclipseAppLauncher.start(EclipseAppLauncher.java:107)
  org.eclipse.core.runtime.adaptor.EclipseStarter.run(EclipseStarter.java:400)
  org.eclipse.core.runtime.adaptor.EclipseStarter.run(EclipseStarter.java:255)
  sun.reflect.NativeMethodAccessorImpl.invoke0(Native Method)
  sun.reflect.NativeMethodAccessorImpl.invoke(NativeMethodAccessorImpl.java:62)
  sun.reflect.DelegatingMethodAccessorImpl.invoke(DelegatingMethodAccessorImpl.java:43)
  java.lang.reflect.Method.invoke(Method.java:498)
  org.eclipse.equinox.launcher.Main.invokeFramework(Main.java:661)
  org.eclipse.equinox.launcher.Main.basicRun(Main.java:597)
  org.eclipse.equinox.launcher.Main.run(Main.java:1476)
  org.eclipse.equinox.launcher.Main.main(Main.java:1449)

Thread[Java indexing,4,main]
  java.lang.Object.wait(Native Method)
  java.lang.Object.wait(Object.java:502)
  org.eclipse.jdt.internal.core.search.processing.JobManager.run(JobManager.java:378)
  java.lang.Thread.run(Thread.java:748)

Thread[Worker-JM,5,main]
  java.lang.Object.wait(Native Method)
  org.eclipse.core.internal.jobs.InternalWorker.run(InternalWorker.java:62)

Thread[WorkbenchTestable,6,main]
  java.lang.Object.wait(Native Method)
  java.lang.Object.wait(Object.java:502)
  org.eclipse.swt.widgets.Synchronizer.syncExec(Synchronizer.java:253)
  org.eclipse.ui.internal.UISynchronizer.syncExec(UISynchronizer.java:147)
  org.eclipse.swt.widgets.Display.syncExec(Display.java:5927)
  org.eclipse.e4.ui.internal.workbench.swt.E4Testable.runTest(E4Testable.java:117)
  org.eclipse.tycho.surefire.osgibooter.AbstractUITestApplication.runTests(AbstractUITestApplication.java:32)
  org.eclipse.e4.ui.internal.workbench.swt.E4Testable.lambda$0(E4Testable.java:76)
  org.eclipse.e4.ui.internal.workbench.swt.E4Testable$$Lambda$159/889961821.run(Unknown Source)
  java.lang.Thread.run(Thread.java:748)

Thread[EMF Reference Cleaner,6,main]
  java.lang.Object.wait(Native Method)
  java.lang.ref.ReferenceQueue.remove(ReferenceQueue.java:144)
  java.lang.ref.ReferenceQueue.remove(ReferenceQueue.java:165)
  org.eclipse.emf.common.util.CommonUtil$1ReferenceClearingQueuePollingThread.run(CommonUtil.java:70)


OpenJDK 64-Bit Server VM warning: ignoring option MaxPermSize=256m; support was removed in 8.0

(SWT:29490): Gtk-WARNING **: 00:20:08.042: gtk_widget_size_allocate(): attempt to allocate widget with width -3 and height -3
SLF4J: Failed to load class "org.slf4j.impl.StaticLoggerBinder".
SLF4J: Defaulting to no-operation (NOP) logger implementation
SLF4J: See http://www.slf4j.org/codes.html#StaticLoggerBinder for further details.
OpenJDK 64-Bit Server VM warning: ignoring option MaxPermSize=256m; support was removed in 8.0
log4j:WARN No appenders could be found for logger (org.springframework.core.io.support.PathMatchingResourcePatternResolver).
log4j:WARN Please initialize the log4j system properly.
OpenJDK 64-Bit Server VM warning: ignoring option MaxPermSize=256m; support was removed in 8.0
OpenJDK 64-Bit Server VM warning: ignoring option MaxPermSize=256m; support was removed in 8.0
Forcing manual proxy configuration
System: Linux 4.15.0-50-generic (amd64) / linux-x86_64-gtk / AdoptOpenJDK OpenJDK 64-Bit Server VM 1.8.0_212
Proxy : null (Platform) / [DIRECT] (Java)

Running testMarkerCreated(org.springframework.ide.eclipse.bestpractices.tests.ruletests.ImportElementsAtTopRuleTest)
Running testMarkerNotCreated(org.springframework.ide.eclipse.bestpractices.tests.ruletests.ImportElementsAtTopRuleTest)
Running testMarkerCreated(org.springframework.ide.eclipse.bestpractices.tests.ruletests.ParentBeanSpecifiesAbstractClassRuleTest)
Running testMarkerNotCreated(org.springframework.ide.eclipse.bestpractices.tests.ruletests.ParentBeanSpecifiesAbstractClassRuleTest)
Running testMarkerCreated(org.springframework.ide.eclipse.bestpractices.tests.ruletests.TooManyBeansInFileRuleTest)
Running testMarkerNotCreated(org.springframework.ide.eclipse.bestpractices.tests.ruletests.TooManyBeansInFileRuleTest)
Running testMarkerCreated(org.springframework.ide.eclipse.bestpractices.tests.ruletests.RefElementRuleTest)
Running testMarkerNotCreated(org.springframework.ide.eclipse.bestpractices.tests.ruletests.RefElementRuleTest)
Running testMarkerCreated(org.springframework.ide.eclipse.bestpractices.tests.ruletests.UnnecessaryValueElementRuleTest)
Running testMarkerNotCreated(org.springframework.ide.eclipse.bestpractices.tests.ruletests.UnnecessaryValueElementRuleTest)
Running testMarkerCreated(org.springframework.ide.eclipse.bestpractices.tests.ruletests.UseBeanInheritanceRuleTest)
Running testMarkerNotCreated1(org.springframework.ide.eclipse.bestpractices.tests.ruletests.UseBeanInheritanceRuleTest)
Running testMarkerNotCreated2(org.springframework.ide.eclipse.bestpractices.tests.ruletests.UseBeanInheritanceRuleTest)
Running testMarkerNotCreated3(org.springframework.ide.eclipse.bestpractices.tests.ruletests.UseBeanInheritanceRuleTest)
Running testMarkerNotCreated4(org.springframework.ide.eclipse.bestpractices.tests.ruletests.UseBeanInheritanceRuleTest)
Running testMarkerNotCreated5(org.springframework.ide.eclipse.bestpractices.tests.ruletests.UseBeanInheritanceRuleTest)
Running testMarkerCreated(org.springframework.ide.eclipse.bestpractices.tests.ruletests.AvoidDriverManagerDataSourceRuleTest)
Running testMarkerNotCreated(org.springframework.ide.eclipse.bestpractices.tests.ruletests.AvoidDriverManagerDataSourceRuleTest)
Running testMarkerCreated(org.springframework.ide.eclipse.bestpractices.tests.ruletests.UseDedicatedNamespacesRuleTest)
Running testMarkerNotCreated(org.springframework.ide.eclipse.bestpractices.tests.ruletests.UseDedicatedNamespacesRuleTest)

Failures:

Errors:

0 out of 20 tests failed
Running ShutdownWatchdog
OpenJDK 64-Bit Server VM warning: ignoring option MaxPermSize=256m; support was removed in 8.0
log4j:WARN No appenders could be found for logger (org.springframework.beans.CachedIntrospectionResults).
log4j:WARN Please initialize the log4j system properly.