Build: #4 failed

Job: Default Job failed

Stages & jobs

  1. Default Stage

Job result summary

Completed
Duration
123 minutes
Agent
bamboo-19.af.pivotal.io
Revision
99be8ba1eca81f7dfa5c237679988f79bc6465a6 99be8ba1eca81f7dfa5c237679988f79bc6465a6
Total tests
1157
Failing since
#1 (First build for this plan – )
Fixed in
#23 (Code changes detected)

Tests

  • 1,157 tests in total
  • 2 tests failed
  • 4 tests were quarantined / skipped
  • 66 minutes taken in total.
Existing test failures 2
Status Test Failing since Duration
java.lang.AssertionError: null
	at org.junit.Assert.fail(Assert.java:86)
	at org.junit.Assert.assertTrue(Assert.java:41)
	at org.junit.Assert.assertFalse(Assert.java:64)
	at org.junit.Assert.assertFalse(Assert.java:74)
	at org.springframework.ide.eclipse.boot.dash.test.BootDashModelTest.testAutoInstallSpringCloudCLICustom(BootDashModelTest.java:233)
org.eclipse.core.runtime.CoreException: FileNotFoundException: /opt/bamboo-home/xml-data/build-dir/HTTPSONLY-IDECITEST-JOB1/plugins/org.springframework.ide.eclipse.boot.launch.test/target/work/data/gradle-test-project/pom.xml (No such file or directory)
	at org.springsource.ide.eclipse.commons.livexp.util.ExceptionUtil.coreException(ExceptionUtil.java:46)
	at org.springframework.ide.eclipse.boot.test.BootProjectTestHarness.assertOk(BootProjectTestHarness.java:369)
	at org.springframework.ide.eclipse.boot.test.BootProjectTestHarness$7.test(BootProjectTestHarness.java:286)
	at org.springsource.ide.eclipse.commons.frameworks.test.util.ACondition.doTest(ACondition.java:143)
	at org.springsource.ide.eclipse.commons.frameworks.test.util.ACondition.waitFor(ACondition.java:103)
	at org.springsource.ide.eclipse.commons.frameworks.test.util.ACondition.<init>(ACondition.java:87)
	at org.springframework.ide.eclipse.boot.test.BootProjectTestHarness$7.<init>(BootProjectTestHarness.java:283)
(22 more lines...)

Error summary

The build generated some errors. See the full build log for more details.


Thread[Worker-JM,5,main]
  java.lang.Object.wait(Native Method)
  org.eclipse.core.internal.jobs.InternalWorker.run(InternalWorker.java:62)

Thread[Bundle File Closer,5,main]
  java.lang.Object.wait(Native Method)
  java.lang.Object.wait(Object.java:502)
  org.eclipse.osgi.framework.eventmgr.EventManager$EventThread.getNextEvent(EventManager.java:403)
  org.eclipse.osgi.framework.eventmgr.EventManager$EventThread.run(EventManager.java:339)

Thread[Framework Event Dispatcher: Equinox Container: 4991ee93-7551-4920-a2dd-c80e95576170,5,main]
  java.lang.Object.wait(Native Method)
  java.lang.Object.wait(Object.java:502)
  org.eclipse.osgi.framework.eventmgr.EventManager$EventThread.getNextEvent(EventManager.java:403)
  org.eclipse.osgi.framework.eventmgr.EventManager$EventThread.run(EventManager.java:339)

Thread[Active Thread: Equinox Container: 4991ee93-7551-4920-a2dd-c80e95576170,5,main]
  sun.misc.Unsafe.park(Native Method)
  java.util.concurrent.locks.LockSupport.parkNanos(LockSupport.java:215)
  java.util.concurrent.locks.AbstractQueuedSynchronizer$ConditionObject.awaitNanos(AbstractQueuedSynchronizer.java:2078)
  java.util.concurrent.ScheduledThreadPoolExecutor$DelayedWorkQueue.take(ScheduledThreadPoolExecutor.java:1093)
  java.util.concurrent.ScheduledThreadPoolExecutor$DelayedWorkQueue.take(ScheduledThreadPoolExecutor.java:809)
  java.util.concurrent.ThreadPoolExecutor.getTask(ThreadPoolExecutor.java:1074)
  java.util.concurrent.ThreadPoolExecutor.runWorker(ThreadPoolExecutor.java:1134)
  java.util.concurrent.ThreadPoolExecutor$Worker.run(ThreadPoolExecutor.java:624)
  java.lang.Thread.run(Thread.java:748)

Thread[EMF Reference Cleaner,6,main]
  java.lang.Object.wait(Native Method)
  java.lang.ref.ReferenceQueue.remove(ReferenceQueue.java:144)
  java.lang.ref.ReferenceQueue.remove(ReferenceQueue.java:165)
  org.eclipse.emf.common.util.CommonUtil$1ReferenceClearingQueuePollingThread.run(CommonUtil.java:70)

Thread[Worker-9,5,main]
  java.lang.Object.wait(Native Method)
  org.eclipse.core.internal.jobs.WorkerPool.sleep(WorkerPool.java:200)
  org.eclipse.core.internal.jobs.WorkerPool.startJob(WorkerPool.java:242)
  org.eclipse.core.internal.jobs.Worker.run(Worker.java:58)

Thread[Signal Dispatcher,9,system]

Thread[Worker-7,5,main]
  java.lang.Object.wait(Native Method)
  org.eclipse.core.internal.jobs.WorkerPool.sleep(WorkerPool.java:200)
  org.eclipse.core.internal.jobs.WorkerPool.startJob(WorkerPool.java:242)
  org.eclipse.core.internal.jobs.Worker.run(Worker.java:58)

Thread[EventAdmin Async Event Dispatcher Thread,6,Equinox Event Admin]
  java.lang.Object.wait(Native Method)
  java.lang.Object.wait(Object.java:502)
  org.eclipse.osgi.framework.eventmgr.EventManager$EventThread.getNextEvent(EventManager.java:403)
  org.eclipse.osgi.framework.eventmgr.EventManager$EventThread.run(EventManager.java:339)


OpenJDK 64-Bit Server VM warning: ignoring option MaxPermSize=256m; support was removed in 8.0

(SWT:21585): Gtk-WARNING **: 23:25:31.947: gtk_widget_size_allocate(): attempt to allocate widget with width -3 and height -3
SLF4J: Failed to load class "org.slf4j.impl.StaticLoggerBinder".
SLF4J: Defaulting to no-operation (NOP) logger implementation
SLF4J: See http://www.slf4j.org/codes.html#StaticLoggerBinder for further details.
OpenJDK 64-Bit Server VM warning: ignoring option MaxPermSize=256m; support was removed in 8.0
log4j:WARN No appenders could be found for logger (org.springframework.core.io.support.PathMatchingResourcePatternResolver).
log4j:WARN Please initialize the log4j system properly.
OpenJDK 64-Bit Server VM warning: ignoring option MaxPermSize=256m; support was removed in 8.0
OpenJDK 64-Bit Server VM warning: ignoring option MaxPermSize=256m; support was removed in 8.0
Forcing manual proxy configuration
System: Linux 4.15.0-50-generic (amd64) / linux-x86_64-gtk / AdoptOpenJDK OpenJDK 64-Bit Server VM 1.8.0_212
Proxy : null (Platform) / [DIRECT] (Java)

Running testMarkerCreated(org.springframework.ide.eclipse.bestpractices.tests.ruletests.ImportElementsAtTopRuleTest)
Running testMarkerNotCreated(org.springframework.ide.eclipse.bestpractices.tests.ruletests.ImportElementsAtTopRuleTest)
Running testMarkerCreated(org.springframework.ide.eclipse.bestpractices.tests.ruletests.ParentBeanSpecifiesAbstractClassRuleTest)
Running testMarkerNotCreated(org.springframework.ide.eclipse.bestpractices.tests.ruletests.ParentBeanSpecifiesAbstractClassRuleTest)
Running testMarkerCreated(org.springframework.ide.eclipse.bestpractices.tests.ruletests.TooManyBeansInFileRuleTest)
Running testMarkerNotCreated(org.springframework.ide.eclipse.bestpractices.tests.ruletests.TooManyBeansInFileRuleTest)
Running testMarkerCreated(org.springframework.ide.eclipse.bestpractices.tests.ruletests.RefElementRuleTest)
Running testMarkerNotCreated(org.springframework.ide.eclipse.bestpractices.tests.ruletests.RefElementRuleTest)
Running testMarkerCreated(org.springframework.ide.eclipse.bestpractices.tests.ruletests.UnnecessaryValueElementRuleTest)
Running testMarkerNotCreated(org.springframework.ide.eclipse.bestpractices.tests.ruletests.UnnecessaryValueElementRuleTest)
Running testMarkerCreated(org.springframework.ide.eclipse.bestpractices.tests.ruletests.UseBeanInheritanceRuleTest)
Running testMarkerNotCreated1(org.springframework.ide.eclipse.bestpractices.tests.ruletests.UseBeanInheritanceRuleTest)
Running testMarkerNotCreated2(org.springframework.ide.eclipse.bestpractices.tests.ruletests.UseBeanInheritanceRuleTest)
Running testMarkerNotCreated3(org.springframework.ide.eclipse.bestpractices.tests.ruletests.UseBeanInheritanceRuleTest)
Running testMarkerNotCreated4(org.springframework.ide.eclipse.bestpractices.tests.ruletests.UseBeanInheritanceRuleTest)
Running testMarkerNotCreated5(org.springframework.ide.eclipse.bestpractices.tests.ruletests.UseBeanInheritanceRuleTest)
Running testMarkerCreated(org.springframework.ide.eclipse.bestpractices.tests.ruletests.AvoidDriverManagerDataSourceRuleTest)
Running testMarkerNotCreated(org.springframework.ide.eclipse.bestpractices.tests.ruletests.AvoidDriverManagerDataSourceRuleTest)
Running testMarkerCreated(org.springframework.ide.eclipse.bestpractices.tests.ruletests.UseDedicatedNamespacesRuleTest)
Running testMarkerNotCreated(org.springframework.ide.eclipse.bestpractices.tests.ruletests.UseDedicatedNamespacesRuleTest)

Failures:

Errors:

0 out of 20 tests failed
Running ShutdownWatchdog
OpenJDK 64-Bit Server VM warning: ignoring option MaxPermSize=256m; support was removed in 8.0
log4j:WARN No appenders could be found for logger (org.springframework.beans.CachedIntrospectionResults).
log4j:WARN Please initialize the log4j system properly.