Build: #84 failed

Job: Default Job failed

Stages & jobs

  1. Default Stage

Job result summary

Completed
Duration
99 minutes
Agent
bamboo-21.af.pivotal.io
Revision
043e2b0992efb2e28777582e7b46fdd4981b936a 043e2b0992efb2e28777582e7b46fdd4981b936a
Total tests
1169

Tests

  • 1,169 tests in total
  • 4 tests failed
  • 4 failures are new
  • 6 tests were quarantined / skipped
  • 71 minutes taken in total.
New test failures 4
Status Test Duration
Collapse Failed EditStartersModelTest addBomWithSubsetOfRepos History
2 mins
org.eclipse.core.runtime.CoreException: AssertionError: The wanted bootVersion '2.2.1.RELEASE'is not found in the wizard
	at org.springsource.ide.eclipse.commons.livexp.util.ExceptionUtil.coreException(ExceptionUtil.java:46)
	at org.springframework.ide.eclipse.boot.test.BootProjectTestHarness.assertOk(BootProjectTestHarness.java:371)
	at org.springframework.ide.eclipse.boot.test.BootProjectTestHarness$7.test(BootProjectTestHarness.java:288)
	at org.springsource.ide.eclipse.commons.frameworks.test.util.ACondition.doTest(ACondition.java:143)
	at org.springsource.ide.eclipse.commons.frameworks.test.util.ACondition.waitFor(ACondition.java:103)
	at org.springsource.ide.eclipse.commons.frameworks.test.util.ACondition.<init>(ACondition.java:87)
	at org.springframework.ide.eclipse.boot.test.BootProjectTestHarness$7.<init>(BootProjectTestHarness.java:285)
(10 more lines...)
Collapse Failed EditStartersModelTest addDependencyWithRepo History
2 mins
org.eclipse.core.runtime.CoreException: AssertionError: The wanted bootVersion '2.2.1.RELEASE'is not found in the wizard
	at org.springsource.ide.eclipse.commons.livexp.util.ExceptionUtil.coreException(ExceptionUtil.java:46)
	at org.springframework.ide.eclipse.boot.test.BootProjectTestHarness.assertOk(BootProjectTestHarness.java:371)
	at org.springframework.ide.eclipse.boot.test.BootProjectTestHarness$7.test(BootProjectTestHarness.java:288)
	at org.springsource.ide.eclipse.commons.frameworks.test.util.ACondition.doTest(ACondition.java:143)
	at org.springsource.ide.eclipse.commons.frameworks.test.util.ACondition.waitFor(ACondition.java:103)
	at org.springsource.ide.eclipse.commons.frameworks.test.util.ACondition.<init>(ACondition.java:87)
	at org.springframework.ide.eclipse.boot.test.BootProjectTestHarness$7.<init>(BootProjectTestHarness.java:285)
(10 more lines...)
Collapse Failed EditStartersModelTest addMultipleStartersWithDifferentBom History
2 mins
org.eclipse.core.runtime.CoreException: AssertionError: The wanted bootVersion '2.2.1.RELEASE'is not found in the wizard
	at org.springsource.ide.eclipse.commons.livexp.util.ExceptionUtil.coreException(ExceptionUtil.java:46)
	at org.springframework.ide.eclipse.boot.test.BootProjectTestHarness.assertOk(BootProjectTestHarness.java:371)
	at org.springframework.ide.eclipse.boot.test.BootProjectTestHarness$7.test(BootProjectTestHarness.java:288)
	at org.springsource.ide.eclipse.commons.frameworks.test.util.ACondition.doTest(ACondition.java:143)
	at org.springsource.ide.eclipse.commons.frameworks.test.util.ACondition.waitFor(ACondition.java:103)
	at org.springsource.ide.eclipse.commons.frameworks.test.util.ACondition.<init>(ACondition.java:87)
	at org.springframework.ide.eclipse.boot.test.BootProjectTestHarness$7.<init>(BootProjectTestHarness.java:285)
(10 more lines...)
Collapse Failed EditStartersModelTest addMultipleStartersWithSameBom History
2 mins
org.eclipse.core.runtime.CoreException: AssertionError: The wanted bootVersion '2.2.1.RELEASE'is not found in the wizard
	at org.springsource.ide.eclipse.commons.livexp.util.ExceptionUtil.coreException(ExceptionUtil.java:46)
	at org.springframework.ide.eclipse.boot.test.BootProjectTestHarness.assertOk(BootProjectTestHarness.java:371)
	at org.springframework.ide.eclipse.boot.test.BootProjectTestHarness$7.test(BootProjectTestHarness.java:288)
	at org.springsource.ide.eclipse.commons.frameworks.test.util.ACondition.doTest(ACondition.java:143)
	at org.springsource.ide.eclipse.commons.frameworks.test.util.ACondition.waitFor(ACondition.java:103)
	at org.springsource.ide.eclipse.commons.frameworks.test.util.ACondition.<init>(ACondition.java:87)
	at org.springframework.ide.eclipse.boot.test.BootProjectTestHarness$7.<init>(BootProjectTestHarness.java:285)
(10 more lines...)

Error summary

The build generated some errors. See the full build log for more details.

[cloudfoundry-client-nio-2] DEBUG cloudfoundry-client.response - 200    https://api.run.pivotal.io:443/v2/apps/7e7b0776-4797-4ff1-a607-5dc0ebb3ed4d/summary (306 ms)
[cloudfoundry-client-nio-3] DEBUG cloudfoundry-client.response - 200    https://api.run.pivotal.io:443/v2/apps/7e7b0776-4797-4ff1-a607-5dc0ebb3ed4d/instances (307 ms)
[cloudfoundry-client-nio-3] DEBUG cloudfoundry-client.request - GET    https://api.run.pivotal.io:443/v2/stacks/841d2f2c-c9c7-47f5-9b63-0f1dd1ef280f
[cloudfoundry-client-nio-4] DEBUG cloudfoundry-client.response - 200    https://api.run.pivotal.io:443/v2/stacks/841d2f2c-c9c7-47f5-9b63-0f1dd1ef280f (247 ms)
[cloudfoundry-client-nio-4] DEBUG cloudfoundry-client.operations - FINISH Get Application (onComplete/838 ms)
[main] DEBUG cloudfoundry-client.operations - START  List Service Instances
[main] DEBUG cloudfoundry-client.request - GET    https://api.run.pivotal.io:443/v2/spaces/616810ec-9d61-4c0d-a406-3b682059c20c/summary
[cloudfoundry-client-nio-1] DEBUG cloudfoundry-client.response - 200    https://api.run.pivotal.io:443/v2/spaces/616810ec-9d61-4c0d-a406-3b682059c20c/summary (347 ms)
[cloudfoundry-client-nio-1] DEBUG cloudfoundry-client.operations - FINISH List Service Instances (onComplete/347 ms)
[main] DEBUG cloudfoundry-client.operations - START  Delete Application
[main] DEBUG cloudfoundry-client.request - GET    https://api.run.pivotal.io:443/v2/spaces/616810ec-9d61-4c0d-a406-3b682059c20c/apps?q=name:20191213-oxMFNFnDMd&page=1
[cloudfoundry-client-nio-2] DEBUG cloudfoundry-client.response - 200    https://api.run.pivotal.io:443/v2/spaces/616810ec-9d61-4c0d-a406-3b682059c20c/apps?q=name:20191213-oxMFNFnDMd&page=1 (274 ms)
[cloudfoundry-client-nio-2] DEBUG cloudfoundry-client.request - GET    https://api.run.pivotal.io:443/v2/apps/7e7b0776-4797-4ff1-a607-5dc0ebb3ed4d/service_bindings?page=1
[cloudfoundry-client-nio-3] DEBUG cloudfoundry-client.response - 200    https://api.run.pivotal.io:443/v2/apps/7e7b0776-4797-4ff1-a607-5dc0ebb3ed4d/service_bindings?page=1 (307 ms)
[cloudfoundry-client-nio-3] DEBUG cloudfoundry-client.request - DELETE https://api.run.pivotal.io:443/v2/apps/7e7b0776-4797-4ff1-a607-5dc0ebb3ed4d/service_bindings/6e22be4a-5304-4bf4-855a-7f7477221f85
[cloudfoundry-client-nio-3] DEBUG cloudfoundry-client.request - DELETE https://api.run.pivotal.io:443/v2/apps/7e7b0776-4797-4ff1-a607-5dc0ebb3ed4d/service_bindings/31b46e38-b742-4dfd-b0bc-e1e84507efaf
[cloudfoundry-client-nio-4] WARN cloudfoundry-client.response - 204    https://api.run.pivotal.io:443/v2/apps/7e7b0776-4797-4ff1-a607-5dc0ebb3ed4d/service_bindings/6e22be4a-5304-4bf4-855a-7f7477221f85 (1.8 s) [Endpoint+deprecated]
[cloudfoundry-client-nio-1] WARN cloudfoundry-client.response - 204    https://api.run.pivotal.io:443/v2/apps/7e7b0776-4797-4ff1-a607-5dc0ebb3ed4d/service_bindings/31b46e38-b742-4dfd-b0bc-e1e84507efaf (2.0 s) [Endpoint+deprecated]
[cloudfoundry-client-nio-1] DEBUG cloudfoundry-client.request - DELETE https://api.run.pivotal.io:443/v2/apps/7e7b0776-4797-4ff1-a607-5dc0ebb3ed4d
[cloudfoundry-client-nio-1] DEBUG cloudfoundry-client.response - 204    https://api.run.pivotal.io:443/v2/apps/7e7b0776-4797-4ff1-a607-5dc0ebb3ed4d (403 ms)
[cloudfoundry-client-nio-1] DEBUG cloudfoundry-client.operations - FINISH Delete Application (onComplete/3.0 s)
[main] DEBUG cloudfoundry-client.operations - START  Get Service Instance
[main] DEBUG cloudfoundry-client.request - GET    https://api.run.pivotal.io:443/v2/spaces/616810ec-9d61-4c0d-a406-3b682059c20c/service_instances?q=name:20191213-oIYURfvSaX&page=1&return_user_provided_service_instances=true
[cloudfoundry-client-nio-1] DEBUG cloudfoundry-client.response - 200    https://api.run.pivotal.io:443/v2/spaces/616810ec-9d61-4c0d-a406-3b682059c20c/service_instances?q=name:20191213-oIYURfvSaX&page=1&return_user_provided_service_instances=true (129 ms)
[cloudfoundry-client-nio-1] DEBUG cloudfoundry-client.request - GET    https://api.run.pivotal.io:443/v2/service_plans/ad78d5ba-96a7-44c1-8f77-4a1b79e62f65
[cloudfoundry-client-nio-4] DEBUG cloudfoundry-client.response - 200    https://api.run.pivotal.io:443/v2/service_plans/ad78d5ba-96a7-44c1-8f77-4a1b79e62f65 (170 ms)
[cloudfoundry-client-nio-4] DEBUG cloudfoundry-client.request - GET    https://api.run.pivotal.io:443/v2/service_bindings?q=service_instance_guid:65c652ef-5f98-4d43-8c23-a2e952ef0eb0&page=1
[cloudfoundry-client-nio-4] DEBUG cloudfoundry-client.request - GET    https://api.run.pivotal.io:443/v2/services/3ba9445c-c709-4153-a343-e4ff5807316a
[cloudfoundry-client-nio-2] DEBUG cloudfoundry-client.response - 200    https://api.run.pivotal.io:443/v2/service_bindings?q=service_instance_guid:65c652ef-5f98-4d43-8c23-a2e952ef0eb0&page=1 (242 ms)
[cloudfoundry-client-nio-3] DEBUG cloudfoundry-client.response - 200    https://api.run.pivotal.io:443/v2/services/3ba9445c-c709-4153-a343-e4ff5807316a (261 ms)
[cloudfoundry-client-nio-3] DEBUG cloudfoundry-client.request - DELETE https://api.run.pivotal.io:443/v2/service_instances/65c652ef-5f98-4d43-8c23-a2e952ef0eb0
[cloudfoundry-client-nio-3] DEBUG cloudfoundry-client.operations - FINISH Get Service Instance (onComplete/564 ms)
[cloudfoundry-client-nio-4] DEBUG cloudfoundry-client.response - 204    https://api.run.pivotal.io:443/v2/service_instances/65c652ef-5f98-4d43-8c23-a2e952ef0eb0 (2.5 s)
[main] DEBUG cloudfoundry-client.operations - START  Get Service Instance
[main] DEBUG cloudfoundry-client.request - GET    https://api.run.pivotal.io:443/v2/spaces/616810ec-9d61-4c0d-a406-3b682059c20c/service_instances?q=name:20191213-ZhGhpgmZuk&page=1&return_user_provided_service_instances=true
[cloudfoundry-client-nio-4] DEBUG cloudfoundry-client.response - 200    https://api.run.pivotal.io:443/v2/spaces/616810ec-9d61-4c0d-a406-3b682059c20c/service_instances?q=name:20191213-ZhGhpgmZuk&page=1&return_user_provided_service_instances=true (133 ms)
[cloudfoundry-client-nio-4] DEBUG cloudfoundry-client.request - GET    https://api.run.pivotal.io:443/v2/service_plans/ad78d5ba-96a7-44c1-8f77-4a1b79e62f65
[cloudfoundry-client-nio-1] DEBUG cloudfoundry-client.response - 200    https://api.run.pivotal.io:443/v2/service_plans/ad78d5ba-96a7-44c1-8f77-4a1b79e62f65 (318 ms)
[cloudfoundry-client-nio-1] DEBUG cloudfoundry-client.request - GET    https://api.run.pivotal.io:443/v2/service_bindings?q=service_instance_guid:cf4c83d5-526f-407d-8cae-c8e76faa02e3&page=1
[cloudfoundry-client-nio-1] DEBUG cloudfoundry-client.request - GET    https://api.run.pivotal.io:443/v2/services/3ba9445c-c709-4153-a343-e4ff5807316a
[cloudfoundry-client-nio-3] DEBUG cloudfoundry-client.response - 200    https://api.run.pivotal.io:443/v2/services/3ba9445c-c709-4153-a343-e4ff5807316a (257 ms)
[cloudfoundry-client-nio-2] DEBUG cloudfoundry-client.response - 200    https://api.run.pivotal.io:443/v2/service_bindings?q=service_instance_guid:cf4c83d5-526f-407d-8cae-c8e76faa02e3&page=1 (260 ms)
[cloudfoundry-client-nio-2] DEBUG cloudfoundry-client.request - DELETE https://api.run.pivotal.io:443/v2/service_instances/cf4c83d5-526f-407d-8cae-c8e76faa02e3
[cloudfoundry-client-nio-2] DEBUG cloudfoundry-client.operations - FINISH Get Service Instance (onComplete/716 ms)
[cloudfoundry-client-nio-4] DEBUG cloudfoundry-client.response - 204    https://api.run.pivotal.io:443/v2/service_instances/cf4c83d5-526f-407d-8cae-c8e76faa02e3 (4.7 s)
OpenJDK 64-Bit Server VM warning: ignoring option MaxPermSize=256m; support was removed in 8.0
SLF4J: Failed to load class "org.slf4j.impl.StaticLoggerBinder".
SLF4J: Defaulting to no-operation (NOP) logger implementation
SLF4J: See http://www.slf4j.org/codes.html#StaticLoggerBinder for further details.
OpenJDK 64-Bit Server VM warning: ignoring option MaxPermSize=256m; support was removed in 8.0

(SWT:16071): Gtk-WARNING **: 23:03:37.725: gtk_widget_size_allocate(): attempt to allocate widget with width -3 and height -3
SLF4J: Failed to load class "org.slf4j.impl.StaticLoggerBinder".
SLF4J: Defaulting to no-operation (NOP) logger implementation
SLF4J: See http://www.slf4j.org/codes.html#StaticLoggerBinder for further details.
OpenJDK 64-Bit Server VM warning: ignoring option MaxPermSize=256m; support was removed in 8.0
SLF4J: Failed to load class "org.slf4j.impl.StaticLoggerBinder".
SLF4J: Defaulting to no-operation (NOP) logger implementation
SLF4J: See http://www.slf4j.org/codes.html#StaticLoggerBinder for further details.
OpenJDK 64-Bit Server VM warning: ignoring option MaxPermSize=256m; support was removed in 8.0
log4j:WARN No appenders could be found for logger (org.springframework.core.io.support.PathMatchingResourcePatternResolver).
log4j:WARN Please initialize the log4j system properly.
OpenJDK 64-Bit Server VM warning: ignoring option MaxPermSize=256m; support was removed in 8.0
OpenJDK 64-Bit Server VM warning: ignoring option MaxPermSize=256m; support was removed in 8.0

(SWT:18525): Gtk-WARNING **: 23:14:31.842: gtk_widget_size_allocate(): attempt to allocate widget with width -3 and height -3
Forcing manual proxy configuration
System: Linux 4.15.0-66-generic (amd64) / linux-x86_64-gtk / AdoptOpenJDK OpenJDK 64-Bit Server VM 1.8.0_232
Proxy : null (Platform) / [DIRECT] (Java)

Running testMarkerCreated(org.springframework.ide.eclipse.bestpractices.tests.ruletests.ImportElementsAtTopRuleTest)
Running testMarkerNotCreated(org.springframework.ide.eclipse.bestpractices.tests.ruletests.ImportElementsAtTopRuleTest)
Running testMarkerCreated(org.springframework.ide.eclipse.bestpractices.tests.ruletests.ParentBeanSpecifiesAbstractClassRuleTest)
Running testMarkerNotCreated(org.springframework.ide.eclipse.bestpractices.tests.ruletests.ParentBeanSpecifiesAbstractClassRuleTest)
Running testMarkerCreated(org.springframework.ide.eclipse.bestpractices.tests.ruletests.TooManyBeansInFileRuleTest)
Running testMarkerNotCreated(org.springframework.ide.eclipse.bestpractices.tests.ruletests.TooManyBeansInFileRuleTest)
Running testMarkerCreated(org.springframework.ide.eclipse.bestpractices.tests.ruletests.RefElementRuleTest)
Running testMarkerNotCreated(org.springframework.ide.eclipse.bestpractices.tests.ruletests.RefElementRuleTest)
Running testMarkerCreated(org.springframework.ide.eclipse.bestpractices.tests.ruletests.UnnecessaryValueElementRuleTest)
Running testMarkerNotCreated(org.springframework.ide.eclipse.bestpractices.tests.ruletests.UnnecessaryValueElementRuleTest)
Running testMarkerCreated(org.springframework.ide.eclipse.bestpractices.tests.ruletests.UseBeanInheritanceRuleTest)
Running testMarkerNotCreated1(org.springframework.ide.eclipse.bestpractices.tests.ruletests.UseBeanInheritanceRuleTest)
Running testMarkerNotCreated2(org.springframework.ide.eclipse.bestpractices.tests.ruletests.UseBeanInheritanceRuleTest)
Running testMarkerNotCreated3(org.springframework.ide.eclipse.bestpractices.tests.ruletests.UseBeanInheritanceRuleTest)
Running testMarkerNotCreated4(org.springframework.ide.eclipse.bestpractices.tests.ruletests.UseBeanInheritanceRuleTest)
Running testMarkerNotCreated5(org.springframework.ide.eclipse.bestpractices.tests.ruletests.UseBeanInheritanceRuleTest)
Running testMarkerCreated(org.springframework.ide.eclipse.bestpractices.tests.ruletests.AvoidDriverManagerDataSourceRuleTest)
Running testMarkerNotCreated(org.springframework.ide.eclipse.bestpractices.tests.ruletests.AvoidDriverManagerDataSourceRuleTest)
Running testMarkerCreated(org.springframework.ide.eclipse.bestpractices.tests.ruletests.UseDedicatedNamespacesRuleTest)
Running testMarkerNotCreated(org.springframework.ide.eclipse.bestpractices.tests.ruletests.UseDedicatedNamespacesRuleTest)

Failures:

Errors:

0 out of 20 tests failed
Running ShutdownWatchdog
OpenJDK 64-Bit Server VM warning: ignoring option MaxPermSize=256m; support was removed in 8.0
log4j:WARN No appenders could be found for logger (org.springframework.beans.CachedIntrospectionResults).
log4j:WARN Please initialize the log4j system properly.