Build: #84 failed

Job: Default Job failed

Stages & jobs

  1. Default Stage

Add bom with subset of repos: Test case result

The below summarizes the result of the test "Add bom with subset of repos" in build 84 of HTTPS-ONLY - Spring IDE - CI HTTPS test - Default Job. View test case history
Description
Add bom with subset of repos
Test class
org.springframework.ide.eclipse.boot.test.EditStartersModelTest
Method
addBomWithSubsetOfRepos
Duration
2 mins
Status
Failed (New Failure)

Error Log

org.eclipse.core.runtime.CoreException: AssertionError: The wanted bootVersion '2.2.1.RELEASE'is not found in the wizard
	at org.springsource.ide.eclipse.commons.livexp.util.ExceptionUtil.coreException(ExceptionUtil.java:46)
	at org.springframework.ide.eclipse.boot.test.BootProjectTestHarness.assertOk(BootProjectTestHarness.java:371)
	at org.springframework.ide.eclipse.boot.test.BootProjectTestHarness$7.test(BootProjectTestHarness.java:288)
	at org.springsource.ide.eclipse.commons.frameworks.test.util.ACondition.doTest(ACondition.java:143)
	at org.springsource.ide.eclipse.commons.frameworks.test.util.ACondition.waitFor(ACondition.java:103)
	at org.springsource.ide.eclipse.commons.frameworks.test.util.ACondition.<init>(ACondition.java:87)
	at org.springframework.ide.eclipse.boot.test.BootProjectTestHarness$7.<init>(BootProjectTestHarness.java:285)
	at org.springframework.ide.eclipse.boot.test.BootProjectTestHarness.waitForImportJob(BootProjectTestHarness.java:285)
	at org.springframework.ide.eclipse.boot.test.BootProjectTestHarness.lambda$3(BootProjectTestHarness.java:275)
	at org.springframework.ide.eclipse.boot.util.RetryUtil.retryWhen(RetryUtil.java:34)
	at org.springframework.ide.eclipse.boot.test.BootProjectTestHarness.createBootProject(BootProjectTestHarness.java:243)
	at org.springframework.ide.eclipse.boot.test.EditStartersModelTest.addBomWithSubsetOfRepos(EditStartersModelTest.java:581)
Caused by: java.lang.AssertionError: The wanted bootVersion '2.2.1.RELEASE'is not found in the wizard
	at org.junit.Assert.fail(Assert.java:88)
	at org.springframework.ide.eclipse.boot.test.BootProjectTestHarness$4.apply(BootProjectTestHarness.java:163)
	at org.springframework.ide.eclipse.boot.test.BootProjectTestHarness$6.run(BootProjectTestHarness.java:263)
	at org.eclipse.core.internal.jobs.Worker.run(Worker.java:63)