Build: #865 failed Scheduled

Build result summary

Details

Completed
Duration
49 minutes
Labels
None
Revision
ceb8af72eca3f86e01041f7ae7b7fc7d6e86935f ceb8af72eca3f86e01041f7ae7b7fc7d6e86935f
Total tests
4624

Tests

Responsible

No one has taken responsibility for this failure

Tests

New test failures 1
Status Test View job Duration
Collapse Failed JdbcPollingChannelAdapterParserTests testMaxRowsInboundChannelAdapter History
Default Job < 1 sec
org.springframework.jdbc.BadSqlGrammarException: org.springframework.jdbc.BadSqlGrammarException: StatementCallback; bad SQL grammar [delete from item]; nested exception is java.sql.SQLSyntaxErrorException: user lacks privilege or object not found: ITEM
org.springframework.jdbc.BadSqlGrammarException: StatementCallback; bad SQL grammar [delete from item]; nested exception is java.sql.SQLSyntaxErrorException: user lacks privilege or object not found: ITEM
	at org.springframework.jdbc.support.SQLExceptionSubclassTranslator.doTranslate(SQLExceptionSubclassTranslator.java:91)
	at org.springframework.jdbc.support.AbstractFallbackSQLExceptionTranslator.translate(AbstractFallbackSQLExceptionTranslator.java:73)
	at org.springframework.jdbc.support.AbstractFallbackSQLExceptionTranslator.translate(AbstractFallbackSQLExceptionTranslator.java:81)
	at org.springframework.jdbc.core.JdbcTemplate.execute(JdbcTemplate.java:415)
	at org.springframework.jdbc.core.JdbcTemplate.update(JdbcTemplate.java:534)
	at org.springframework.integration.jdbc.config.JdbcPollingChannelAdapterParserTests.setUp(JdbcPollingChannelAdapterParserTests.java:194)
(66 more lines...)