Build: #865 failed

Job: Default Job failed

Stages & jobs

  1. Default Stage

Job result summary

Completed
Duration
49 minutes
Revision
ceb8af72eca3f86e01041f7ae7b7fc7d6e86935f ceb8af72eca3f86e01041f7ae7b7fc7d6e86935f
Total tests
4624

Tests

  • 4,624 tests in total
  • 1 test failed
  • 1 failure is new
  • 133 tests were quarantined / skipped
  • 17 minutes taken in total.
New test failures 1
Status Test Duration
Collapse Failed JdbcPollingChannelAdapterParserTests testMaxRowsInboundChannelAdapter History
< 1 sec
org.springframework.jdbc.BadSqlGrammarException: org.springframework.jdbc.BadSqlGrammarException: StatementCallback; bad SQL grammar [delete from item]; nested exception is java.sql.SQLSyntaxErrorException: user lacks privilege or object not found: ITEM
org.springframework.jdbc.BadSqlGrammarException: StatementCallback; bad SQL grammar [delete from item]; nested exception is java.sql.SQLSyntaxErrorException: user lacks privilege or object not found: ITEM
	at org.springframework.jdbc.support.SQLExceptionSubclassTranslator.doTranslate(SQLExceptionSubclassTranslator.java:91)
	at org.springframework.jdbc.support.AbstractFallbackSQLExceptionTranslator.translate(AbstractFallbackSQLExceptionTranslator.java:73)
	at org.springframework.jdbc.support.AbstractFallbackSQLExceptionTranslator.translate(AbstractFallbackSQLExceptionTranslator.java:81)
	at org.springframework.jdbc.core.JdbcTemplate.execute(JdbcTemplate.java:415)
	at org.springframework.jdbc.core.JdbcTemplate.update(JdbcTemplate.java:534)
	at org.springframework.integration.jdbc.config.JdbcPollingChannelAdapterParserTests.setUp(JdbcPollingChannelAdapterParserTests.java:194)
(66 more lines...)

Error summary

The build generated some errors. See the full build log for more details.

*** java.lang.instrument ASSERTION FAILED ***: "!errorOutstanding" with message transform method call failed at JPLISAgent.c line: 844
*** java.lang.instrument ASSERTION FAILED ***: "!errorOutstanding" with message transform method call failed at JPLISAgent.c line: 844
*** java.lang.instrument ASSERTION FAILED ***: "!errorOutstanding" with message transform method call failed at JPLISAgent.c line: 844
*** java.lang.instrument ASSERTION FAILED ***: "!errorOutstanding" with message transform method call failed at JPLISAgent.c line: 844
POM relocation to an other version number is not fully supported in Gradle : xml-apis#xml-apis;2.0.2 relocated to xml-apis#xml-apis;1.0.b2.
/opt/users/bamboo/.gradle/caches/modules-2/files-2.1/com.gemstone.gemfire/gemfire/8.0.0/763ea5f78d93b46b0c23e1d5cafd36fd2b586223/gemfire-8.0.0.jar(com/gemstone/gemfire/internal/cache/DistributedRegion.class): warning: Cannot find annotation method 'value()' in type 'SuppressWarnings': class file for edu.umd.cs.findbugs.annotations.SuppressWarnings not found
1 warning
warning: Supported source version 'RELEASE_6' from annotation processor 'org.apache.openjpa.persistence.meta.AnnotationProcessor6' less than -source '1.7'
1 warning
*** java.lang.instrument ASSERTION FAILED ***: "!errorOutstanding" with message transform method call failed at JPLISAgent.c line: 844
*** java.lang.instrument ASSERTION FAILED ***: "!errorOutstanding" with message transform method call failed at JPLISAgent.c line: 844
*** java.lang.instrument ASSERTION FAILED ***: "!errorOutstanding" with message transform method call failed at JPLISAgent.c line: 844
*** java.lang.instrument ASSERTION FAILED ***: "!errorOutstanding" with message transform method call failed at JPLISAgent.c line: 844

238 tests completed, 1 failed, 47 skipped

FAILURE: Build failed with an exception.

* What went wrong:
Execution failed for task ':spring-integration-jdbc:test'.
> There were failing tests. See the report at: file:///opt/bamboo-home/xml-data/build-dir/INT-AT42SIO-JOB1/spring-integration-jdbc/build/reports/tests/index.html

* Try:
Run with --stacktrace option to get the stack trace. Run with --info or --debug option to get more log output.