Build: #865 failed

Job: Default Job failed

Stages & jobs

  1. Default Stage

Test results

  • 4,624 tests in total
  • 1 test failed
  • 1 failure is new
  • 133 tests were quarantined / skipped
  • 17 minutes taken in total.

Build 865 has the following 1 errors: 1 new failure(s) occurred since the previous build.

New test failures 1
Status Test Duration
Collapse Failed JdbcPollingChannelAdapterParserTests testMaxRowsInboundChannelAdapter History
< 1 sec
org.springframework.jdbc.BadSqlGrammarException: org.springframework.jdbc.BadSqlGrammarException: StatementCallback; bad SQL grammar [delete from item]; nested exception is java.sql.SQLSyntaxErrorException: user lacks privilege or object not found: ITEM
org.springframework.jdbc.BadSqlGrammarException: StatementCallback; bad SQL grammar [delete from item]; nested exception is java.sql.SQLSyntaxErrorException: user lacks privilege or object not found: ITEM
	at org.springframework.jdbc.support.SQLExceptionSubclassTranslator.doTranslate(SQLExceptionSubclassTranslator.java:91)
	at org.springframework.jdbc.support.AbstractFallbackSQLExceptionTranslator.translate(AbstractFallbackSQLExceptionTranslator.java:73)
	at org.springframework.jdbc.support.AbstractFallbackSQLExceptionTranslator.translate(AbstractFallbackSQLExceptionTranslator.java:81)
	at org.springframework.jdbc.core.JdbcTemplate.execute(JdbcTemplate.java:415)
	at org.springframework.jdbc.core.JdbcTemplate.update(JdbcTemplate.java:534)
	at org.springframework.integration.jdbc.config.JdbcPollingChannelAdapterParserTests.setUp(JdbcPollingChannelAdapterParserTests.java:194)
(66 more lines...)