4.1.x Maintenance Branch

Build: #124 failed

Job: Default Job failed

Stages & jobs

  1. Default Stage

Job result summary

Completed
Duration
14 minutes
Revision
d614fa8f84700570c99bcc5bf2e03b00f03a631e d614fa8f84700570c99bcc5bf2e03b00f03a631e
Total tests
4048
Fixed in
#125 (Code changes detected)

Tests

  • 4,048 tests in total
  • 1 test failed
  • 1 failure is new
  • 217 tests were quarantined / skipped
  • 7 minutes taken in total.
New test failures 1
Status Test Duration
Collapse Failed SftpServerOutboundTests testInt3088MPutRecursiveFiltered History
< 1 sec
org.springframework.messaging.MessagingException: org.springframework.messaging.MessagingException: nested exception is org.springframework.messaging.MessagingException: Failed to execute on session; nested exception is java.lang.IllegalStateException: failed to create SFTP Session
org.springframework.messaging.MessagingException: nested exception is org.springframework.messaging.MessagingException: Failed to execute on session; nested exception is java.lang.IllegalStateException: failed to create SFTP Session
	at org.springframework.integration.dispatcher.AbstractDispatcher.wrapExceptionIfNecessary(AbstractDispatcher.java:133)
	at org.springframework.integration.dispatcher.AbstractDispatcher.tryOptimizedDispatch(AbstractDispatcher.java:120)
	at org.springframework.integration.dispatcher.UnicastingDispatcher.doDispatch(UnicastingDispatcher.java:101)
	at org.springframework.integration.dispatcher.UnicastingDispatcher.dispatch(UnicastingDispatcher.java:97)
	at org.springframework.integration.channel.AbstractSubscribableChannel.doSend(AbstractSubscribableChannel.java:77)
	at org.springframework.integration.channel.AbstractMessageChannel.send(AbstractMessageChannel.java:287)
(80 more lines...)

Error summary

The build generated some errors. See the full build log for more details.

POM relocation to an other version number is not fully supported in Gradle : xml-apis#xml-apis;2.0.2 relocated to xml-apis#xml-apis;1.0.b2.
/opt/bamboo-home/xml-data/build-dir/INT-B41X-JOB1/spring-integration-amqp/src/test/java/org/springframework/integration/amqp/StubRabbitConnectionFactory.java:498: warning: [deprecation] clearFlowListeners() in Channel has been deprecated
                public void clearFlowListeners() {
                            ^
/opt/bamboo-home/xml-data/build-dir/INT-B41X-JOB1/spring-integration-amqp/src/test/java/org/springframework/integration/amqp/StubRabbitConnectionFactory.java:493: warning: [deprecation] removeFlowListener(FlowListener) in Channel has been deprecated
                public boolean removeFlowListener(FlowListener listener) {
                               ^
/opt/bamboo-home/xml-data/build-dir/INT-B41X-JOB1/spring-integration-amqp/src/test/java/org/springframework/integration/amqp/StubRabbitConnectionFactory.java:489: warning: [deprecation] addFlowListener(FlowListener) in Channel has been deprecated
                public void addFlowListener(FlowListener listener) {
                            ^
/opt/bamboo-home/xml-data/build-dir/INT-B41X-JOB1/spring-integration-amqp/src/test/java/org/springframework/integration/amqp/StubRabbitConnectionFactory.java:150: warning: [deprecation] flowBlocked() in Channel has been deprecated
                public boolean flowBlocked() {
                               ^
4 warnings
*** java.lang.instrument ASSERTION FAILED ***: "!errorOutstanding" with message transform method call failed at JPLISAgent.c line: 844
*** java.lang.instrument ASSERTION FAILED ***: "!errorOutstanding" with message transform method call failed at JPLISAgent.c line: 844
*** java.lang.instrument ASSERTION FAILED ***: "!errorOutstanding" with message transform method call failed at JPLISAgent.c line: 844
*** java.lang.instrument ASSERTION FAILED ***: "!errorOutstanding" with message transform method call failed at JPLISAgent.c line: 844
/opt/bamboo-home/xml-data/build-dir/INT-B41X-JOB1/spring-integration-sftp/src/test/java/org/springframework/integration/sftp/session/SftpServerTests.java:78: warning: [unchecked] unchecked generic array creation for varargs parameter of type NamedFactory<Command>[]
                        server.setSubsystemFactories(Arrays.<NamedFactory<Command>>asList(sftp));
                                                                                         ^
/opt/bamboo-home/xml-data/build-dir/INT-B41X-JOB1/spring-integration-sftp/src/test/java/org/springframework/integration/sftp/session/SftpServerTests.java:140: warning: [unchecked] unchecked generic array creation for varargs parameter of type NamedFactory<Command>[]
                        server.setSubsystemFactories(Arrays.<NamedFactory<Command>>asList(sftp));
                                                                                         ^
2 warnings

61 tests completed, 1 failed, 5 skipped

FAILURE: Build failed with an exception.

* What went wrong:
Execution failed for task ':spring-integration-sftp:test'.
> There were failing tests. See the report at: file:///opt/bamboo-home/xml-data/build-dir/INT-B41X-JOB1/spring-integration-sftp/build/reports/tests/index.html

* Try:
Run with --stacktrace option to get the stack trace. Run with --info or --debug option to get more log output.