4.1.x Maintenance Branch

Build: #124 failed

Job: Default Job failed

Stages & jobs

  1. Default Stage

Test results

  • 4,048 tests in total
  • 1 test failed
  • 1 failure is new
  • 217 tests were quarantined / skipped
  • 7 minutes taken in total.

Build 124 has the following 1 errors: 1 new failure(s) occurred since the previous build.

New test failures 1
Status Test Duration
Collapse Failed SftpServerOutboundTests testInt3088MPutRecursiveFiltered History
< 1 sec
org.springframework.messaging.MessagingException: org.springframework.messaging.MessagingException: nested exception is org.springframework.messaging.MessagingException: Failed to execute on session; nested exception is java.lang.IllegalStateException: failed to create SFTP Session
org.springframework.messaging.MessagingException: nested exception is org.springframework.messaging.MessagingException: Failed to execute on session; nested exception is java.lang.IllegalStateException: failed to create SFTP Session
	at org.springframework.integration.dispatcher.AbstractDispatcher.wrapExceptionIfNecessary(AbstractDispatcher.java:133)
	at org.springframework.integration.dispatcher.AbstractDispatcher.tryOptimizedDispatch(AbstractDispatcher.java:120)
	at org.springframework.integration.dispatcher.UnicastingDispatcher.doDispatch(UnicastingDispatcher.java:101)
	at org.springframework.integration.dispatcher.UnicastingDispatcher.dispatch(UnicastingDispatcher.java:97)
	at org.springframework.integration.channel.AbstractSubscribableChannel.doSend(AbstractSubscribableChannel.java:77)
	at org.springframework.integration.channel.AbstractMessageChannel.send(AbstractMessageChannel.java:287)
(80 more lines...)