4.1.x Maintenance Branch

Build: #124 failed

Job: Default Job failed

Stages & jobs

  1. Default Stage

Int3088 m put recursive filtered: Test case result

The below summarizes the result of the test "Int3088 m put recursive filtered" in build 124 of Spring Integration - 4.1.x - Default Job. View test case history
Description
Int3088 m put recursive filtered
Test class
org.springframework.integration.sftp.outbound.SftpServerOutboundTests
Method
testInt3088MPutRecursiveFiltered
Duration
< 1 sec
Status
Failed (New Failure)

Error Log

org.springframework.messaging.MessagingException: org.springframework.messaging.MessagingException: nested exception is org.springframework.messaging.MessagingException: Failed to execute on session; nested exception is java.lang.IllegalStateException: failed to create SFTP Session
org.springframework.messaging.MessagingException: nested exception is org.springframework.messaging.MessagingException: Failed to execute on session; nested exception is java.lang.IllegalStateException: failed to create SFTP Session
	at org.springframework.integration.dispatcher.AbstractDispatcher.wrapExceptionIfNecessary(AbstractDispatcher.java:133)
	at org.springframework.integration.dispatcher.AbstractDispatcher.tryOptimizedDispatch(AbstractDispatcher.java:120)
	at org.springframework.integration.dispatcher.UnicastingDispatcher.doDispatch(UnicastingDispatcher.java:101)
	at org.springframework.integration.dispatcher.UnicastingDispatcher.dispatch(UnicastingDispatcher.java:97)
	at org.springframework.integration.channel.AbstractSubscribableChannel.doSend(AbstractSubscribableChannel.java:77)
	at org.springframework.integration.channel.AbstractMessageChannel.send(AbstractMessageChannel.java:287)
	at org.springframework.integration.channel.AbstractMessageChannel.send(AbstractMessageChannel.java:245)
	at org.springframework.integration.sftp.outbound.SftpServerOutboundTests.testInt3088MPutRecursiveFiltered(SftpServerOutboundTests.java:367)
	at sun.reflect.NativeMethodAccessorImpl.invoke0(Native Method)
	at sun.reflect.NativeMethodAccessorImpl.invoke(NativeMethodAccessorImpl.java:62)
	at sun.reflect.DelegatingMethodAccessorImpl.invoke(DelegatingMethodAccessorImpl.java:43)
	at java.lang.reflect.Method.invoke(Method.java:498)
	at org.junit.runners.model.FrameworkMethod$1.runReflectiveCall(FrameworkMethod.java:47)
	at org.junit.internal.runners.model.ReflectiveCallable.run(ReflectiveCallable.java:12)
	at org.junit.runners.model.FrameworkMethod.invokeExplosively(FrameworkMethod.java:44)
	at org.junit.internal.runners.statements.InvokeMethod.evaluate(InvokeMethod.java:17)
	at org.junit.internal.runners.statements.RunBefores.evaluate(RunBefores.java:26)
	at org.springframework.test.context.junit4.statements.RunBeforeTestMethodCallbacks.evaluate(RunBeforeTestMethodCallbacks.java:75)
	at org.junit.internal.runners.statements.RunAfters.evaluate(RunAfters.java:27)
	at org.springframework.test.context.junit4.statements.RunAfterTestMethodCallbacks.evaluate(RunAfterTestMethodCallbacks.java:86)
	at org.springframework.test.context.junit4.statements.SpringRepeat.evaluate(SpringRepeat.java:70)
	at org.junit.runners.ParentRunner.runLeaf(ParentRunner.java:271)
	at org.springframework.test.context.junit4.SpringJUnit4ClassRunner.runChild(SpringJUnit4ClassRunner.java:224)
	at org.springframework.test.context.junit4.SpringJUnit4ClassRunner.runChild(SpringJUnit4ClassRunner.java:83)
	at org.junit.runners.ParentRunner$3.run(ParentRunner.java:238)
	at org.junit.runners.ParentRunner$1.schedule(ParentRunner.java:63)
	at org.junit.runners.ParentRunner.runChildren(ParentRunner.java:236)
	at org.junit.runners.ParentRunner.access$000(ParentRunner.java:53)
	at org.junit.runners.ParentRunner$2.evaluate(ParentRunner.java:229)
	at org.springframework.test.context.junit4.statements.RunBeforeTestClassCallbacks.evaluate(RunBeforeTestClassCallbacks.java:61)
	at org.springframework.test.context.junit4.statements.RunAfterTestClassCallbacks.evaluate(RunAfterTestClassCallbacks.java:70)
	at org.junit.runners.ParentRunner.run(ParentRunner.java:309)
	at org.springframework.test.context.junit4.SpringJUnit4ClassRunner.run(SpringJUnit4ClassRunner.java:163)
	at org.gradle.api.internal.tasks.testing.junit.JUnitTestClassExecuter.runTestClass(JUnitTestClassExecuter.java:114)
	at org.gradle.api.internal.tasks.testing.junit.JUnitTestClassExecuter.execute(JUnitTestClassExecuter.java:57)
	at org.gradle.api.internal.tasks.testing.junit.JUnitTestClassProcessor.processTestClass(JUnitTestClassProcessor.java:66)
	at org.gradle.api.internal.tasks.testing.SuiteTestClassProcessor.processTestClass(SuiteTestClassProcessor.java:51)
	at sun.reflect.NativeMethodAccessorImpl.invoke0(Native Method)
	at sun.reflect.NativeMethodAccessorImpl.invoke(NativeMethodAccessorImpl.java:62)
	at sun.reflect.DelegatingMethodAccessorImpl.invoke(DelegatingMethodAccessorImpl.java:43)
	at java.lang.reflect.Method.invoke(Method.java:498)
	at org.gradle.internal.dispatch.ReflectionDispatch.dispatch(ReflectionDispatch.java:35)
	at org.gradle.internal.dispatch.ReflectionDispatch.dispatch(ReflectionDispatch.java:24)
	at org.gradle.internal.dispatch.ContextClassLoaderDispatch.dispatch(ContextClassLoaderDispatch.java:32)
	at org.gradle.internal.dispatch.ProxyDispatchAdapter$DispatchingInvocationHandler.invoke(ProxyDispatchAdapter.java:93)
	at com.sun.proxy.$Proxy2.processTestClass(Unknown Source)
	at org.gradle.api.internal.tasks.testing.worker.TestWorker.processTestClass(TestWorker.java:109)
	at sun.reflect.NativeMethodAccessorImpl.invoke0(Native Method)
	at sun.reflect.NativeMethodAccessorImpl.invoke(NativeMethodAccessorImpl.java:62)
	at sun.reflect.DelegatingMethodAccessorImpl.invoke(DelegatingMethodAccessorImpl.java:43)
	at java.lang.reflect.Method.invoke(Method.java:498)
	at org.gradle.internal.dispatch.ReflectionDispatch.dispatch(ReflectionDispatch.java:35)
	at org.gradle.internal.dispatch.ReflectionDispatch.dispatch(ReflectionDispatch.java:24)
	at org.gradle.internal.remote.internal.hub.MessageHub$Handler.run(MessageHub.java:377)
	at org.gradle.internal.concurrent.ExecutorPolicy$CatchAndRecordFailures.onExecute(ExecutorPolicy.java:54)
	at org.gradle.internal.concurrent.StoppableExecutorImpl$1.run(StoppableExecutorImpl.java:40)
	at java.util.concurrent.ThreadPoolExecutor.runWorker(ThreadPoolExecutor.java:1149)
	at java.util.concurrent.ThreadPoolExecutor$Worker.run(ThreadPoolExecutor.java:624)
	at java.lang.Thread.run(Thread.java:748)
Caused by: org.springframework.messaging.MessagingException: Failed to execute on session; nested exception is java.lang.IllegalStateException: failed to create SFTP Session
	at org.springframework.integration.file.remote.RemoteFileTemplate.execute(RemoteFileTemplate.java:351)
	at org.springframework.integration.file.remote.RemoteFileTemplate.send(RemoteFileTemplate.java:211)
	at org.springframework.integration.file.remote.RemoteFileTemplate.send(RemoteFileTemplate.java:201)
	at org.springframework.integration.file.remote.gateway.AbstractRemoteFileOutboundGateway.doPut(AbstractRemoteFileOutboundGateway.java:513)
	at org.springframework.integration.file.remote.gateway.AbstractRemoteFileOutboundGateway.putLocalDirectory(AbstractRemoteFileOutboundGateway.java:546)
	at org.springframework.integration.file.remote.gateway.AbstractRemoteFileOutboundGateway.putLocalDirectory(AbstractRemoteFileOutboundGateway.java:562)
	at org.springframework.integration.file.remote.gateway.AbstractRemoteFileOutboundGateway.doMput(AbstractRemoteFileOutboundGateway.java:535)
	at org.springframework.integration.file.remote.gateway.AbstractRemoteFileOutboundGateway.handleRequestMessage(AbstractRemoteFileOutboundGateway.java:422)
	at org.springframework.integration.handler.AbstractReplyProducingMessageHandler.handleMessageInternal(AbstractReplyProducingMessageHandler.java:99)
	at org.springframework.integration.handler.AbstractMessageHandler.handleMessage(AbstractMessageHandler.java:78)
	at org.springframework.integration.dispatcher.AbstractDispatcher.tryOptimizedDispatch(AbstractDispatcher.java:116)
	... 57 more
Caused by: java.lang.IllegalStateException: failed to create SFTP Session
	at org.springframework.integration.sftp.session.DefaultSftpSessionFactory.getSession(DefaultSftpSessionFactory.java:382)
	at org.springframework.integration.sftp.session.DefaultSftpSessionFactory.getSession(DefaultSftpSessionFactory.java:55)
	at org.springframework.integration.file.remote.RemoteFileTemplate.execute(RemoteFileTemplate.java:340)
	... 67 more
Caused by: java.lang.IllegalStateException: failed to connect
	at org.springframework.integration.sftp.session.SftpSession.connect(SftpSession.java:272)
	at org.springframework.integration.sftp.session.DefaultSftpSessionFactory.getSession(DefaultSftpSessionFactory.java:377)
	... 69 more
Caused by: com.jcraft.jsch.JSchException: Session.connect: java.security.SignatureException: Invalid encoding for signature
	at com.jcraft.jsch.Session.connect(Session.java:558)
	at com.jcraft.jsch.Session.connect(Session.java:183)
	at org.springframework.integration.sftp.session.SftpSession.connect(SftpSession.java:263)
	... 70 more