Plan for building against test branches

Build: #46 failed Manual run by Artem Bilan

Logs

The following logs have been generated by the jobs in this plan.
  • Expand all
  • Collapse all
Job Logs
Collapse Default Job Default Stage Download or View
18-May-2018 21:14:10
18-May-2018 21:14:10 org.springframework.integration.webflux.dsl.WebFluxDslTests > testHttpReactivePost FAILED
18-May-2018 21:14:10     org.springframework.beans.factory.BeanCreationException
18-May-2018 21:14:10         Caused by: org.springframework.beans.factory.NoSuchBeanDefinitionException
18-May-2018 21:14:11
18-May-2018 21:14:11 23 tests completed, 4 failed
18-May-2018 21:14:11
18-May-2018 21:14:11 > Task :spring-integration-webflux:test FAILED
18-May-2018 21:14:11
18-May-2018 21:14:11 Deprecated Gradle features were used in this build, making it incompatible with Gradle 5.0.
18-May-2018 21:14:11 See https://docs.gradle.org/4.7/userguide/command_line_interface.html#sec:command_line_warnings
18-May-2018 21:14:11
18-May-2018 21:14:11 BUILD FAILED in 17m 16s
18-May-2018 21:14:11 374 actionable tasks: 339 executed, 35 up-to-date
18-May-2018 21:14:11
18-May-2018 21:14:11 FAILURE: Build failed with an exception.
18-May-2018 21:14:11
18-May-2018 21:14:11 * What went wrong:
18-May-2018 21:14:11 Execution failed for task ':spring-integration-webflux:test'.
18-May-2018 21:14:11 > There were failing tests. See the report at: file:///opt/bamboo-home/xml-data/build-dir/INT-BSP32-JOB1/spring-integration-webflux/build/reports/tests/test/index.html
18-May-2018 21:14:11
18-May-2018 21:14:11 * Try:
18-May-2018 21:14:11 Run with --stacktrace option to get the stack trace. Run with --info or --debug option to get more log output. Run with --scan to get full insights.
18-May-2018 21:14:11
18-May-2018 21:14:11 * Get more help at https://help.gradle.org