Plan for building against test branches

Build: #46 failed Manual run by Artem Bilan

Test results

  • 4,724 tests in total
  • 4 tests failed
  • 4 failures are new
  • 241 tests were quarantined / skipped
  • 6 minutes taken in total.
New test failures 4
Status Test View job Duration
Collapse Failed WebFluxDslTests testSse History
Default Job < 1 sec
org.springframework.beans.factory.BeanCreationException: org.springframework.beans.factory.BeanCreationException: Error creating bean with name 'org.springframework.integration.webflux.dsl.WebFluxDslTests': Injection of resource dependencies failed; nested exception is org.springframework.beans.factory.NoSuchBeanDefinitionException: No bean named 'org.springframework.integration.webflux.outbound.WebFluxRequestExecutingMessageHandler#1' available
org.springframework.beans.factory.BeanCreationException: Error creating bean with name 'org.springframework.integration.webflux.dsl.WebFluxDslTests': Injection of resource dependencies failed; nested exception is org.springframework.beans.factory.NoSuchBeanDefinitionException: No bean named 'org.springframework.integration.webflux.outbound.WebFluxRequestExecutingMessageHandler#1' available
	at org.springframework.context.annotation.CommonAnnotationBeanPostProcessor.postProcessPropertyValues(CommonAnnotationBeanPostProcessor.java:321)
	at org.springframework.beans.factory.support.AbstractAutowireCapableBeanFactory.populateBean(AbstractAutowireCapableBeanFactory.java:1348)
	at org.springframework.beans.factory.support.AbstractAutowireCapableBeanFactory.autowireBeanProperties(AbstractAutowireCapableBeanFactory.java:399)
	at org.springframework.test.context.support.DependencyInjectionTestExecutionListener.injectDependencies(DependencyInjectionTestExecutionListener.java:118)
	at org.springframework.test.context.support.DependencyInjectionTestExecutionListener.prepareTestInstance(DependencyInjectionTestExecutionListener.java:83)
	at org.springframework.test.context.TestContextManager.prepareTestInstance(TestContextManager.java:246)
(74 more lines...)
Collapse Failed WebFluxDslTests testHttpReactivePost History
Default Job < 1 sec
org.springframework.beans.factory.BeanCreationException: org.springframework.beans.factory.BeanCreationException: Error creating bean with name 'org.springframework.integration.webflux.dsl.WebFluxDslTests': Injection of resource dependencies failed; nested exception is org.springframework.beans.factory.NoSuchBeanDefinitionException: No bean named 'org.springframework.integration.webflux.outbound.WebFluxRequestExecutingMessageHandler#1' available
org.springframework.beans.factory.BeanCreationException: Error creating bean with name 'org.springframework.integration.webflux.dsl.WebFluxDslTests': Injection of resource dependencies failed; nested exception is org.springframework.beans.factory.NoSuchBeanDefinitionException: No bean named 'org.springframework.integration.webflux.outbound.WebFluxRequestExecutingMessageHandler#1' available
	at org.springframework.context.annotation.CommonAnnotationBeanPostProcessor.postProcessPropertyValues(CommonAnnotationBeanPostProcessor.java:321)
	at org.springframework.beans.factory.support.AbstractAutowireCapableBeanFactory.populateBean(AbstractAutowireCapableBeanFactory.java:1348)
	at org.springframework.beans.factory.support.AbstractAutowireCapableBeanFactory.autowireBeanProperties(AbstractAutowireCapableBeanFactory.java:399)
	at org.springframework.test.context.support.DependencyInjectionTestExecutionListener.injectDependencies(DependencyInjectionTestExecutionListener.java:118)
	at org.springframework.test.context.support.DependencyInjectionTestExecutionListener.prepareTestInstance(DependencyInjectionTestExecutionListener.java:83)
	at org.springframework.test.context.TestContextManager.prepareTestInstance(TestContextManager.java:246)
(74 more lines...)
Collapse Failed WebFluxDslTests testWebFluxFlowWithReplyPayloadToFlux History
Default Job < 1 sec
org.springframework.beans.factory.BeanCreationException: org.springframework.beans.factory.BeanCreationException: Error creating bean with name 'org.springframework.integration.webflux.dsl.WebFluxDslTests': Injection of resource dependencies failed; nested exception is org.springframework.beans.factory.NoSuchBeanDefinitionException: No bean named 'org.springframework.integration.webflux.outbound.WebFluxRequestExecutingMessageHandler#1' available
org.springframework.beans.factory.BeanCreationException: Error creating bean with name 'org.springframework.integration.webflux.dsl.WebFluxDslTests': Injection of resource dependencies failed; nested exception is org.springframework.beans.factory.NoSuchBeanDefinitionException: No bean named 'org.springframework.integration.webflux.outbound.WebFluxRequestExecutingMessageHandler#1' available
	at org.springframework.context.annotation.CommonAnnotationBeanPostProcessor.postProcessPropertyValues(CommonAnnotationBeanPostProcessor.java:321)
	at org.springframework.beans.factory.support.AbstractAutowireCapableBeanFactory.populateBean(AbstractAutowireCapableBeanFactory.java:1348)
	at org.springframework.beans.factory.support.AbstractAutowireCapableBeanFactory.autowireBeanProperties(AbstractAutowireCapableBeanFactory.java:399)
	at org.springframework.test.context.support.DependencyInjectionTestExecutionListener.injectDependencies(DependencyInjectionTestExecutionListener.java:118)
	at org.springframework.test.context.support.DependencyInjectionTestExecutionListener.prepareTestInstance(DependencyInjectionTestExecutionListener.java:83)
	at org.springframework.test.context.TestContextManager.prepareTestInstance(TestContextManager.java:246)
(74 more lines...)
Collapse Failed WebFluxDslTests testHttpReactiveProxyFlow History
Default Job < 1 sec
org.springframework.beans.factory.BeanCreationException: org.springframework.beans.factory.BeanCreationException: Error creating bean with name 'org.springframework.integration.webflux.dsl.WebFluxDslTests': Injection of resource dependencies failed; nested exception is org.springframework.beans.factory.NoSuchBeanDefinitionException: No bean named 'org.springframework.integration.webflux.outbound.WebFluxRequestExecutingMessageHandler#1' available
org.springframework.beans.factory.BeanCreationException: Error creating bean with name 'org.springframework.integration.webflux.dsl.WebFluxDslTests': Injection of resource dependencies failed; nested exception is org.springframework.beans.factory.NoSuchBeanDefinitionException: No bean named 'org.springframework.integration.webflux.outbound.WebFluxRequestExecutingMessageHandler#1' available
	at org.springframework.context.annotation.CommonAnnotationBeanPostProcessor.postProcessPropertyValues(CommonAnnotationBeanPostProcessor.java:321)
	at org.springframework.beans.factory.support.AbstractAutowireCapableBeanFactory.populateBean(AbstractAutowireCapableBeanFactory.java:1348)
	at org.springframework.beans.factory.support.AbstractAutowireCapableBeanFactory.autowireBeanProperties(AbstractAutowireCapableBeanFactory.java:399)
	at org.springframework.test.context.support.DependencyInjectionTestExecutionListener.injectDependencies(DependencyInjectionTestExecutionListener.java:118)
	at org.springframework.test.context.support.DependencyInjectionTestExecutionListener.prepareTestInstance(DependencyInjectionTestExecutionListener.java:83)
	at org.springframework.test.context.TestContextManager.prepareTestInstance(TestContextManager.java:246)
(74 more lines...)
Skipped tests 100
Status Test Failing since View job
Skipped AggregatorTests testTrackedCorrelationIdsCapacityPassesLimit History
Default Job
Skipped AggregatorTests testTrackedCorrelationIdsCapacityAtLimit History
Default Job
Skipped ConcurrentAggregatorTests testTrackedCorrelationIdsCapacityAtLimit History
Default Job
Skipped ConcurrentAggregatorTests testCompleteGroupWithinTimeoutWithSameId History
Default Job
Skipped ConcurrentAggregatorTests testTrackedCorrelationIdsCapacityPassesLimit History
Default Job
Skipped AggregationResendTests testAggregatorWithTimeoutReturnsOnlyOneMessage History
Default Job
Skipped AggregationResendTests testAggregatorWithoutExplicitTimeoutReturnsOnlyOneMessage History
Default Job
Skipped AggregatorWithCustomReleaseStrategyTests classMethod History
Default Job
Skipped DelayerUsageTests testDelayWithCustomScheduler History
Default Job
Skipped NestedChainParserTests handlersAreNotSame History
Default Job
Skipped NestedChainParserTests chainsAreNotSame History
Default Job
Skipped MessageIdGenerationTests performanceTest History
Default Job
Skipped AggregateMessageDeliveryExceptionTests shouldThrow History
Default Job
Skipped FeedInboundChannelAdapterParserTests validateSuccessfulNewsRetrievalWithHttpUrl History
Default Job
Skipped FileWritingMessageHandlerTests testCreateDirFail History
Default Job
Skipped FtpInboundOutboundSanitySample testFtpInboundChannelAdapter History
Default Job
Skipped FtpInboundOutboundSanitySample testFtpOutboundChannelAdapter History
Default Job
Skipped BigMGetTests doTest History
Default Job
Skipped SessionFactoryTests testConnectionLimit History
Default Job
Skipped DelayerHandlerRescheduleIntegrationTests classMethod History
Default Job
Skipped GemfireGroupStoreTests testConcurrentModifications History
Default Job
Skipped GroovyScriptExecutingMessageProcessorTests testRefreshableScriptExecution History
Default Job
Skipped MessageHistoryIntegrationTests testMessageHistoryWithHistoryPerformance History
Default Job
Skipped DefaultHttpHeaderMapperFromMessageOutboundTests perf History
Default Job
Skipped TcpOutboundGatewayTests classMethod History
Default Job
Skipped ConnectionTimeoutTests testNetSimpleTimeout History
Default Job
Skipped ConnectionTimeoutTests testNioReplyTimeout History
Default Job
Skipped ConnectionTimeoutTests testNioReplyNotTimeout History
Default Job
Skipped ConnectionTimeoutTests testNetReplyNotTimeout History
Default Job
Skipped ConnectionTimeoutTests testDefaultTimeout History
Default Job
Skipped ConnectionTimeoutTests testNetReplyTimeout History
Default Job
Skipped TcpNioConnectionReadTests testCloseCleanupLengthHeader History
Default Job
Skipped TcpNioConnectionReadTests testFragmented History
Default Job
Skipped TcpNioConnectionReadTests testReadStxEtxOverflow History
Default Job
Skipped TcpNioConnectionReadTests testReadCrLfOverflow History
Default Job
Skipped TcpNioConnectionReadTests testCloseCleanupPartialData History
Default Job
Skipped TcpNioConnectionReadTests testCloseCleanupNoData History
Default Job
Skipped TcpNioConnectionReadTests testReadCrLf History
Default Job
Skipped TcpNioConnectionReadTests testReadStxEtx History
Default Job
Skipped TcpNioConnectionReadTests testReadLength History
Default Job
Skipped TcpNioConnectionReadTests testCloseCleanupStxEtx History
Default Job
Skipped TcpNioConnectionReadTests testCloseCleanupCrLf History
Default Job
Skipped TcpNioConnectionReadTests testReadLengthOverflow History
Default Job
Skipped TcpNioConnectionTests testNoDelayOnClose History
Default Job
Skipped DeserializationTests deserializationEvents History
Default Job
Skipped DeserializationTests testReadCrLf History
Default Job
Skipped DeserializationTests testReadLengthOverflow History
Default Job
Skipped DeserializationTests testReadStxEtxOverflow History
Default Job
Skipped DeserializationTests testReadStxEtxTimeout History
Default Job
Skipped DeserializationTests testReadSerialized History
Default Job
Skipped DeserializationTests testTimeoutWithRawDeserializer History
Default Job
Skipped DeserializationTests testReadRawElastic History
Default Job
Skipped DeserializationTests testReadLength History
Default Job
Skipped DeserializationTests canDeserializeMultipleSubsequentTerminators History
Default Job
Skipped DeserializationTests testReadCrLfOverflow History
Default Job
Skipped DeserializationTests testTimeoutWithCustomDeserializer History
Default Job
Skipped DeserializationTests testReadRaw History
Default Job
Skipped DeserializationTests testReadCrLfTimeout History
Default Job
Skipped DeserializationTests testReadStxEtx History
Default Job
Skipped MultiClientTests testAck History
Default Job
Skipped MultiClientTests testNoAck History
Default Job
Skipped MultiClientTests testAckWithLength History
Default Job
Skipped DelayerHandlerRescheduleIntegrationTests testRollbackOnDelayerHandlerReleaseTask History
Default Job
Skipped DelayerHandlerRescheduleIntegrationTests testDelayerHandlerRescheduleWithJdbcMessageStore History
Default Job
Skipped MessageGroupQueueTests classMethod History
Default Job
Skipped MySqlJdbcMessageStoreMultipleChannelTests testSendAndActivateTransactionalSend History
Default Job
Skipped MySqlJdbcMessageStoreTests testAddAndGetWithDifferentRegion History
Default Job
Skipped MySqlJdbcMessageStoreTests testSerializer History
Default Job
Skipped MySqlJdbcMessageStoreTests testOrderInMessageGroup History
Default Job
Skipped MySqlJdbcMessageStoreTests testSize History
Default Job
Skipped MySqlJdbcMessageStoreTests testAddAndGet History
Default Job
Skipped MySqlJdbcMessageStoreTests testSameMessageToMultipleGroups History
Default Job
Skipped MySqlJdbcMessageStoreTests testCompleteMessageGroup History
Default Job
Skipped MySqlJdbcMessageStoreTests testSameMessageAndGroupToMultipleRegions History
Default Job
Skipped MySqlJdbcMessageStoreTests testMessageGroupCount History
Default Job
Skipped MySqlJdbcMessageStoreTests testUpdateLastReleasedSequence History
Default Job
Skipped MySqlJdbcMessageStoreTests testExpireMessageGroupOnCreateOnly History
Default Job
Skipped MySqlJdbcMessageStoreTests testAddAndRemoveMessageFromMessageGroup History
Default Job
Skipped MySqlJdbcMessageStoreTests testGetNonExistent History
Default Job
Skipped MySqlJdbcMessageStoreTests testAddAndUpdateWithChange History
Default Job
Skipped MySqlJdbcMessageStoreTests testAddAndUpdateAlreadySaved History
Default Job
Skipped MySqlJdbcMessageStoreTests testAddAndRemoveMessageGroup History
Default Job
Skipped MySqlJdbcMessageStoreTests testMessageGroupSizes History
Default Job
Skipped MySqlJdbcMessageStoreTests testAddAndGetMessageGroup History
Default Job
Skipped MySqlJdbcMessageStoreTests testRemoveMessageGroup History
Default Job
Skipped MySqlJdbcMessageStoreTests testExpireMessageGroupOnIdleOnly History
Default Job
Skipped MySqlJdbcMessageStoreTests testWithMessageHistory History
Default Job
Skipped MySqlJdbcMessageStoreTests testMessagePollingFromTheGroup History
Default Job
Skipped MySqlJdbcMessageStoreTests testAddAndUpdate History
Default Job
Skipped MySqlJdbcMessageStoreTests testAddAndUpdateAlreadySavedAndCopied History
Default Job
Skipped DerbyTxTimeoutMessageStoreTests testInt3181ConcurrentPolling History
Default Job
Skipped DerbyTxTimeoutMessageStoreTests testPriorityChannel History
Default Job
Skipped DerbyTxTimeoutMessageStoreTests testMessageSequenceColumn History
Default Job
Skipped DerbyTxTimeoutMessageStoreTests test History
Default Job
Skipped DerbyTxTimeoutMessageStoreTests testInt2993IdCacheConcurrency History
Default Job
Skipped H2TxTimeoutMessageStoreTests testMessageSequenceColumn History
Default Job
Skipped H2TxTimeoutMessageStoreTests test History
Default Job
Skipped H2TxTimeoutMessageStoreTests testPriorityChannel History
Default Job
Skipped H2TxTimeoutMessageStoreTests testInt2993IdCacheConcurrency History
Default Job
Skipped H2TxTimeoutMessageStoreTests testInt3181ConcurrentPolling History
Default Job