Plan for building against test branches

Build: #48 failed Manual run by Artem Bilan

Build result summary

Details

Completed
Duration
1 minute
Labels
None
Revision
7edc55f5bf0fce164dabc26f005cc8cb2d008100 7edc55f5bf0fce164dabc26f005cc8cb2d008100
Total tests
134
Failing since
#46 (Manual run by Artem Bilan)
Fixed in
#50 (Manual run by Artem Bilan)

Tests

Responsible

Code commits

Author Commit Message Commit date
Artem Bilan Artem Bilan 7edc55f5bf0fce164dabc26f005cc8cb2d008100 7edc55f5bf0fce164dabc26f005cc8cb2d008100 * Fix `MessageMetricsAdviceTests` to rely on the application context * Do not use a cst in the `StandardIntegrationFlowContext` for `BeanFactory`, but an explicit `BeanDefinitionRegistry` * Extract targets from proxies in the `IntegrationMBeanExporter.postProcessAfterInitialization()` * Remove logging in the `MBeanExporterIntegrationTests`

Tests

New test failures 1
Status Test View job Duration
Collapse Failed MessageSourceTests testMaxFetch History
Default Job < 1 sec
java.lang.IllegalStateException: java.lang.IllegalStateException: Failed to load ApplicationContext
java.lang.IllegalStateException: Failed to load ApplicationContext
	at org.springframework.test.context.cache.DefaultCacheAwareContextLoaderDelegate.loadContext(DefaultCacheAwareContextLoaderDelegate.java:125)
	at org.springframework.test.context.support.DefaultTestContext.getApplicationContext(DefaultTestContext.java:108)
	at org.springframework.test.context.support.DependencyInjectionTestExecutionListener.injectDependencies(DependencyInjectionTestExecutionListener.java:118)
	at org.springframework.test.context.support.DependencyInjectionTestExecutionListener.prepareTestInstance(DependencyInjectionTestExecutionListener.java:83)
	at org.springframework.test.context.TestContextManager.prepareTestInstance(TestContextManager.java:246)
	at org.springframework.test.context.junit4.SpringJUnit4ClassRunner.createTest(SpringJUnit4ClassRunner.java:227)
(90 more lines...)