Plan for building against test branches

Build: #48 failed Manual run by Artem Bilan

Test results

  • 134 tests in total
  • 1 test failed
  • 1 failure is new
  • 3 tests were quarantined / skipped
  • 8 seconds taken in total.
New test failures 1
Status Test View job Duration
Collapse Failed MessageSourceTests testMaxFetch History
Default Job < 1 sec
java.lang.IllegalStateException: java.lang.IllegalStateException: Failed to load ApplicationContext
java.lang.IllegalStateException: Failed to load ApplicationContext
	at org.springframework.test.context.cache.DefaultCacheAwareContextLoaderDelegate.loadContext(DefaultCacheAwareContextLoaderDelegate.java:125)
	at org.springframework.test.context.support.DefaultTestContext.getApplicationContext(DefaultTestContext.java:108)
	at org.springframework.test.context.support.DependencyInjectionTestExecutionListener.injectDependencies(DependencyInjectionTestExecutionListener.java:118)
	at org.springframework.test.context.support.DependencyInjectionTestExecutionListener.prepareTestInstance(DependencyInjectionTestExecutionListener.java:83)
	at org.springframework.test.context.TestContextManager.prepareTestInstance(TestContextManager.java:246)
	at org.springframework.test.context.junit4.SpringJUnit4ClassRunner.createTest(SpringJUnit4ClassRunner.java:227)
(90 more lines...)
Skipped tests 3
Status Test Failing since View job
Skipped DynamicRouterTests testPerf History
Default Job
Skipped MBeanRegistrationTests testServiceActivatorMBeanHasTrackableComponent History
Default Job
Skipped AggregatingMetricsTests perf History
Default Job