Plan for building against test branches

Build: #49 failed Manual run by Artem Bilan

Build result summary

Details

Completed
Duration
1 minute
Labels
None
Revision
bcbd10ac364a31be1121fd1ceb1096a809e02d71 bcbd10ac364a31be1121fd1ceb1096a809e02d71
Total tests
134
Failing since
#46 (Manual run by Artem Bilan)
Fixed in
#50 (Manual run by Artem Bilan)

Tests

Responsible

Code commits

Author Commit Message Commit date
Artem Bilan Artem Bilan bcbd10ac364a31be1121fd1ceb1096a809e02d71 bcbd10ac364a31be1121fd1ceb1096a809e02d71 * Fix `NotificationListeningMessageProducerTests` to reuse existing `MBeanServer`

Tests

Existing test failures 1
Status Test Failing since View job Duration
java.lang.IllegalStateException: java.lang.IllegalStateException: Failed to load ApplicationContext
java.lang.IllegalStateException: Failed to load ApplicationContext
	at org.springframework.test.context.cache.DefaultCacheAwareContextLoaderDelegate.loadContext(DefaultCacheAwareContextLoaderDelegate.java:125)
	at org.springframework.test.context.support.DefaultTestContext.getApplicationContext(DefaultTestContext.java:108)
	at org.springframework.test.context.support.DependencyInjectionTestExecutionListener.injectDependencies(DependencyInjectionTestExecutionListener.java:118)
	at org.springframework.test.context.support.DependencyInjectionTestExecutionListener.prepareTestInstance(DependencyInjectionTestExecutionListener.java:83)
	at org.springframework.test.context.TestContextManager.prepareTestInstance(TestContextManager.java:246)
	at org.springframework.test.context.junit4.SpringJUnit4ClassRunner.createTest(SpringJUnit4ClassRunner.java:227)
(90 more lines...)