Plan for building against test branches

Build: #49 failed Manual run by Artem Bilan

Logs

The following logs have been generated by the jobs in this plan.
  • Expand all
  • Collapse all
Job Logs
Collapse Default Job Default Stage Download or View
18-Oct-2018 18:34:11     java.lang.IllegalStateException
18-Oct-2018 18:34:11         Caused by: org.springframework.jmx.export.UnableToRegisterMBeanException
18-Oct-2018 18:34:11             Caused by: javax.management.InstanceAlreadyExistsException
18-Oct-2018 18:34:29
18-Oct-2018 18:34:29 134 tests completed, 1 failed, 3 skipped
18-Oct-2018 18:34:29
18-Oct-2018 18:34:29 > Task :spring-integration-jmx:testAll FAILED
18-Oct-2018 18:34:29
18-Oct-2018 18:34:29 FAILURE: Build failed with an exception.
18-Oct-2018 18:34:29
18-Oct-2018 18:34:29 * What went wrong:
18-Oct-2018 18:34:29 Execution failed for task ':spring-integration-jmx:testAll'.
18-Oct-2018 18:34:29 > There were failing tests. See the report at: file:///opt/bamboo-home/xml-data/build-dir/INT-BSP32-JOB1/spring-integration-jmx/build/reports/tests/testAll/index.html
18-Oct-2018 18:34:29
18-Oct-2018 18:34:29 * Try:
18-Oct-2018 18:34:29 Run with --stacktrace option to get the stack trace. Run with --info or --debug option to get more log output. Run with --scan to get full insights.
18-Oct-2018 18:34:29
18-Oct-2018 18:34:29 * Get more help at https://help.gradle.org
18-Oct-2018 18:34:29
18-Oct-2018 18:34:29 Deprecated Gradle features were used in this build, making it incompatible with Gradle 5.0.
18-Oct-2018 18:34:29 Use '--warning-mode all' to show the individual deprecation warnings.
18-Oct-2018 18:34:29 See https://docs.gradle.org/4.10.2/userguide/command_line_interface.html#sec:command_line_warnings
18-Oct-2018 18:34:29
18-Oct-2018 18:34:29 BUILD FAILED in 58s
18-Oct-2018 18:34:29 55 actionable tasks: 20 executed, 35 up-to-date