Plan for building against test branches

Build: #46 failed

Job: Default Job failed

Stages & jobs

  1. Default Stage

Job result summary

Completed
Duration
17 minutes
Revision
29b2c7665b8bc374f25d8d80db926c3095cb31f9 29b2c7665b8bc374f25d8d80db926c3095cb31f9
Total tests
4724
Fixed in
#50 (Manual run by Artem Bilan)

Tests

  • 4,724 tests in total
  • 4 tests failed
  • 4 failures are new
  • 241 tests were quarantined / skipped
  • 6 minutes taken in total.
New test failures 4
Status Test Duration
Collapse Failed WebFluxDslTests testHttpReactivePost History
< 1 sec
org.springframework.beans.factory.BeanCreationException: org.springframework.beans.factory.BeanCreationException: Error creating bean with name 'org.springframework.integration.webflux.dsl.WebFluxDslTests': Injection of resource dependencies failed; nested exception is org.springframework.beans.factory.NoSuchBeanDefinitionException: No bean named 'org.springframework.integration.webflux.outbound.WebFluxRequestExecutingMessageHandler#1' available
org.springframework.beans.factory.BeanCreationException: Error creating bean with name 'org.springframework.integration.webflux.dsl.WebFluxDslTests': Injection of resource dependencies failed; nested exception is org.springframework.beans.factory.NoSuchBeanDefinitionException: No bean named 'org.springframework.integration.webflux.outbound.WebFluxRequestExecutingMessageHandler#1' available
	at org.springframework.context.annotation.CommonAnnotationBeanPostProcessor.postProcessPropertyValues(CommonAnnotationBeanPostProcessor.java:321)
	at org.springframework.beans.factory.support.AbstractAutowireCapableBeanFactory.populateBean(AbstractAutowireCapableBeanFactory.java:1348)
	at org.springframework.beans.factory.support.AbstractAutowireCapableBeanFactory.autowireBeanProperties(AbstractAutowireCapableBeanFactory.java:399)
	at org.springframework.test.context.support.DependencyInjectionTestExecutionListener.injectDependencies(DependencyInjectionTestExecutionListener.java:118)
	at org.springframework.test.context.support.DependencyInjectionTestExecutionListener.prepareTestInstance(DependencyInjectionTestExecutionListener.java:83)
	at org.springframework.test.context.TestContextManager.prepareTestInstance(TestContextManager.java:246)
(74 more lines...)
Collapse Failed WebFluxDslTests testHttpReactiveProxyFlow History
< 1 sec
org.springframework.beans.factory.BeanCreationException: org.springframework.beans.factory.BeanCreationException: Error creating bean with name 'org.springframework.integration.webflux.dsl.WebFluxDslTests': Injection of resource dependencies failed; nested exception is org.springframework.beans.factory.NoSuchBeanDefinitionException: No bean named 'org.springframework.integration.webflux.outbound.WebFluxRequestExecutingMessageHandler#1' available
org.springframework.beans.factory.BeanCreationException: Error creating bean with name 'org.springframework.integration.webflux.dsl.WebFluxDslTests': Injection of resource dependencies failed; nested exception is org.springframework.beans.factory.NoSuchBeanDefinitionException: No bean named 'org.springframework.integration.webflux.outbound.WebFluxRequestExecutingMessageHandler#1' available
	at org.springframework.context.annotation.CommonAnnotationBeanPostProcessor.postProcessPropertyValues(CommonAnnotationBeanPostProcessor.java:321)
	at org.springframework.beans.factory.support.AbstractAutowireCapableBeanFactory.populateBean(AbstractAutowireCapableBeanFactory.java:1348)
	at org.springframework.beans.factory.support.AbstractAutowireCapableBeanFactory.autowireBeanProperties(AbstractAutowireCapableBeanFactory.java:399)
	at org.springframework.test.context.support.DependencyInjectionTestExecutionListener.injectDependencies(DependencyInjectionTestExecutionListener.java:118)
	at org.springframework.test.context.support.DependencyInjectionTestExecutionListener.prepareTestInstance(DependencyInjectionTestExecutionListener.java:83)
	at org.springframework.test.context.TestContextManager.prepareTestInstance(TestContextManager.java:246)
(74 more lines...)
Collapse Failed WebFluxDslTests testSse History
< 1 sec
org.springframework.beans.factory.BeanCreationException: org.springframework.beans.factory.BeanCreationException: Error creating bean with name 'org.springframework.integration.webflux.dsl.WebFluxDslTests': Injection of resource dependencies failed; nested exception is org.springframework.beans.factory.NoSuchBeanDefinitionException: No bean named 'org.springframework.integration.webflux.outbound.WebFluxRequestExecutingMessageHandler#1' available
org.springframework.beans.factory.BeanCreationException: Error creating bean with name 'org.springframework.integration.webflux.dsl.WebFluxDslTests': Injection of resource dependencies failed; nested exception is org.springframework.beans.factory.NoSuchBeanDefinitionException: No bean named 'org.springframework.integration.webflux.outbound.WebFluxRequestExecutingMessageHandler#1' available
	at org.springframework.context.annotation.CommonAnnotationBeanPostProcessor.postProcessPropertyValues(CommonAnnotationBeanPostProcessor.java:321)
	at org.springframework.beans.factory.support.AbstractAutowireCapableBeanFactory.populateBean(AbstractAutowireCapableBeanFactory.java:1348)
	at org.springframework.beans.factory.support.AbstractAutowireCapableBeanFactory.autowireBeanProperties(AbstractAutowireCapableBeanFactory.java:399)
	at org.springframework.test.context.support.DependencyInjectionTestExecutionListener.injectDependencies(DependencyInjectionTestExecutionListener.java:118)
	at org.springframework.test.context.support.DependencyInjectionTestExecutionListener.prepareTestInstance(DependencyInjectionTestExecutionListener.java:83)
	at org.springframework.test.context.TestContextManager.prepareTestInstance(TestContextManager.java:246)
(74 more lines...)
Collapse Failed WebFluxDslTests testWebFluxFlowWithReplyPayloadToFlux History
< 1 sec
org.springframework.beans.factory.BeanCreationException: org.springframework.beans.factory.BeanCreationException: Error creating bean with name 'org.springframework.integration.webflux.dsl.WebFluxDslTests': Injection of resource dependencies failed; nested exception is org.springframework.beans.factory.NoSuchBeanDefinitionException: No bean named 'org.springframework.integration.webflux.outbound.WebFluxRequestExecutingMessageHandler#1' available
org.springframework.beans.factory.BeanCreationException: Error creating bean with name 'org.springframework.integration.webflux.dsl.WebFluxDslTests': Injection of resource dependencies failed; nested exception is org.springframework.beans.factory.NoSuchBeanDefinitionException: No bean named 'org.springframework.integration.webflux.outbound.WebFluxRequestExecutingMessageHandler#1' available
	at org.springframework.context.annotation.CommonAnnotationBeanPostProcessor.postProcessPropertyValues(CommonAnnotationBeanPostProcessor.java:321)
	at org.springframework.beans.factory.support.AbstractAutowireCapableBeanFactory.populateBean(AbstractAutowireCapableBeanFactory.java:1348)
	at org.springframework.beans.factory.support.AbstractAutowireCapableBeanFactory.autowireBeanProperties(AbstractAutowireCapableBeanFactory.java:399)
	at org.springframework.test.context.support.DependencyInjectionTestExecutionListener.injectDependencies(DependencyInjectionTestExecutionListener.java:118)
	at org.springframework.test.context.support.DependencyInjectionTestExecutionListener.prepareTestInstance(DependencyInjectionTestExecutionListener.java:83)
	at org.springframework.test.context.TestContextManager.prepareTestInstance(TestContextManager.java:246)
(74 more lines...)

Error summary

The build generated some errors. See the full build log for more details.


FAILURE: Build failed with an exception.

* What went wrong:
Execution failed for task ':spring-integration-webflux:test'.
> There were failing tests. See the report at: file:///opt/bamboo-home/xml-data/build-dir/INT-BSP32-JOB1/spring-integration-webflux/build/reports/tests/test/index.html

* Try:
Run with --stacktrace option to get the stack trace. Run with --info or --debug option to get more log output. Run with --scan to get full insights.

* Get more help at https://help.gradle.org