Plan for building against test branches

Build: #46 failed

Job: Default Job failed

Stages & jobs

  1. Default Stage

Build log

The build generated 846 lines of output. Download or view full build log

18-May-2018 20:56:48 Build Spring Integration - SI Test Plan - Default Job #46 (INT-BSP32-JOB1-46) started building on agent bamboo-02.af.pivotal.io
18-May-2018 20:56:48 Remote agent on host bamboo-02.af.pivotal.io
18-May-2018 20:56:48 Build working directory is /opt/bamboo-home/xml-data/build-dir/INT-BSP32-JOB1
18-May-2018 20:56:48 Executing build Spring Integration - SI Test Plan - Default Job #46 (INT-BSP32-JOB1-46)
18-May-2018 20:56:48 Starting task 'Checkout Default Repository' of type 'com.atlassian.bamboo.plugins.vcs:task.vcs.checkout'
18-May-2018 20:56:48 Build always requires a clean checkout
18-May-2018 20:56:48 Cleaning build directory '/opt/bamboo-home/xml-data/build-dir/INT-BSP32-JOB1'
18-May-2018 20:56:48 Updating source code to revision: 29b2c7665b8bc374f25d8d80db926c3095cb31f9
18-May-2018 20:56:48 Creating local git repository in '/opt/bamboo-home/xml-data/build-dir/INT-BSP32-JOB1/.git'.
18-May-2018 20:56:48 Initialized empty Git repository in /opt/bamboo-home/xml-data/build-dir/INT-BSP32-JOB1/.git/
18-May-2018 20:56:49 Fetching 'refs/heads/FlowContextConcurrency' from 'https://github.com/artembilan/spring-integration.git'.
18-May-2018 20:56:54 From https://github.com/artembilan/spring-integration
18-May-2018 20:56:54 * [new branch]      FlowContextConcurrency -> FlowContextConcurrency
18-May-2018 20:56:54 * [new tag]         v2.0.0.RC1 -> v2.0.0.RC1
18-May-2018 20:56:54 * [new tag]         v2.0.0.RC2 -> v2.0.0.RC2
18-May-2018 20:56:54 * [new tag]         v2.0.0.RELEASE -> v2.0.0.RELEASE
18-May-2018 20:56:54 * [new tag]         v2.0.1.RELEASE -> v2.0.1.RELEASE
18-May-2018 20:56:54 * [new tag]         v2.0.2.RELEASE -> v2.0.2.RELEASE
18-May-2018 20:56:54 * [new tag]         v2.0.3.RELEASE -> v2.0.3.RELEASE
18-May-2018 20:56:54 * [new tag]         v2.0.4.RELEASE -> v2.0.4.RELEASE
18-May-2018 20:56:54 * [new tag]         v2.0.5.RELEASE -> v2.0.5.RELEASE
18-May-2018 20:56:54 * [new tag]         v2.1.0.M1  -> v2.1.0.M1
18-May-2018 20:56:54 * [new tag]         v2.1.0.M2  -> v2.1.0.M2
18-May-2018 20:56:54 * [new tag]         v2.1.0.M3  -> v2.1.0.M3
18-May-2018 20:56:54 * [new tag]         v2.1.0.RC1 -> v2.1.0.RC1
18-May-2018 20:56:54 * [new tag]         v2.1.0.RC2 -> v2.1.0.RC2
18-May-2018 20:56:54 * [new tag]         v2.1.0.RELEASE -> v2.1.0.RELEASE
18-May-2018 20:56:54 * [new tag]         v2.1.1.RELEASE -> v2.1.1.RELEASE
18-May-2018 20:56:54 * [new tag]         v2.2.0.M1  -> v2.2.0.M1
18-May-2018 20:56:54 * [new tag]         v2.2.0.M2  -> v2.2.0.M2
18-May-2018 20:56:54 * [new tag]         v2.2.0.M3  -> v2.2.0.M3
18-May-2018 20:56:54 * [new tag]         v2.2.0.M3.SPRINT1 -> v2.2.0.M3.SPRINT1
18-May-2018 20:56:54 * [new tag]         v2.2.0.M3.SPRINT2 -> v2.2.0.M3.SPRINT2
18-May-2018 20:56:54 * [new tag]         v2.2.0.M3.SPRINT3 -> v2.2.0.M3.SPRINT3
18-May-2018 20:56:54 * [new tag]         v2.2.0.M4  -> v2.2.0.M4
18-May-2018 20:56:54 * [new tag]         v2.2.0.M4.SPRINT1 -> v2.2.0.M4.SPRINT1
18-May-2018 20:56:54 * [new tag]         v2.2.0.M4.SPRINT2 -> v2.2.0.M4.SPRINT2
18-May-2018 20:56:54 * [new tag]         v2.2.0.M4.SPRINT3 -> v2.2.0.M4.SPRINT3
18-May-2018 20:56:54 * [new tag]         v2.2.0.RC1 -> v2.2.0.RC1
18-May-2018 20:56:54 * [new tag]         v2.2.0.RC2 -> v2.2.0.RC2
18-May-2018 20:56:54 * [new tag]         v2.2.0.RC3 -> v2.2.0.RC3
18-May-2018 20:56:54 * [new tag]         v2.2.0.RELEASE -> v2.2.0.RELEASE
18-May-2018 20:56:54 * [new tag]         v2.2.1b.RELEASE -> v2.2.1b.RELEASE
18-May-2018 20:56:54 * [new tag]         v3.0.0.M1  -> v3.0.0.M1
18-May-2018 20:56:54 * [new tag]         v3.0.0.M2  -> v3.0.0.M2
18-May-2018 20:56:54 * [new tag]         v3.0.0.M3  -> v3.0.0.M3
18-May-2018 20:56:54 * [new tag]         v3.0.0.RC1 -> v3.0.0.RC1
18-May-2018 20:56:54 * [new tag]         v3.0.0.RELEASE -> v3.0.0.RELEASE
18-May-2018 20:56:54 * [new tag]         v4.0.0.M2  -> v4.0.0.M2
18-May-2018 20:56:54 * [new tag]         v4.0.0.M3  -> v4.0.0.M3
18-May-2018 20:56:54 * [new tag]         v4.0.0.M4  -> v4.0.0.M4
18-May-2018 20:56:54 * [new tag]         v4.0.0.RC1 -> v4.0.0.RC1
18-May-2018 20:56:54 * [new tag]         v4.0.0.RELEASE -> v4.0.0.RELEASE
18-May-2018 20:56:54 * [new tag]         v4.0.1.RELEASE -> v4.0.1.RELEASE
18-May-2018 20:56:54 * [new tag]         v4.0.2.RELEASE -> v4.0.2.RELEASE
18-May-2018 20:56:54 Checking out revision 29b2c7665b8bc374f25d8d80db926c3095cb31f9.
18-May-2018 20:56:55 Switched to branch 'FlowContextConcurrency'
18-May-2018 20:56:55 Updated source code to revision: 29b2c7665b8bc374f25d8d80db926c3095cb31f9
18-May-2018 20:56:55 Finished task 'Checkout Default Repository' with result: Success
18-May-2018 20:56:55 Running pre-build action: Artifactory Release Staging
18-May-2018 20:56:55 Running pre-build action: VCS Version Collector
18-May-2018 20:56:55 Running pre-build action: Hung Build Killer PreBuildAction
18-May-2018 20:56:55 Starting task 'Artifactory Gradle' of type 'org.jfrog.bamboo.bamboo-artifactory-plugin:artifactoryGradleTask'
18-May-2018 20:56:55 Bamboo Artifactory Plugin version: 2.4.1
18-May-2018 20:56:55
Beginning to execute external process for build 'Spring Integration - SI Test Plan - Default Job #46 (INT-BSP32-JOB1-46)'
... running command line:
./gradlew --no-daemon clean check
... in: /opt/bamboo-home/xml-data/build-dir/INT-BSP32-JOB1
... using extra environment variables:
bamboo_planRepository_1_branch=FlowContextConcurrency
IRBRC=/home/bamboo/.rvm/rubies/ruby-2.3.0/.irbrc
bamboo_signing_store_password=********
bamboo_capability_system_builder_ant_Ant_1_9=/opt/ant-1.9
bamboo_capability_system_builder_ant_Ant_1_8=/opt/ant-1.8
bamboo_planRepository_1_branchDisplayName=FlowContextConcurrency
bamboo_repository_revision_number=29b2c7665b8bc374f25d8d80db926c3095cb31f9
bamboo_RIAK_BIN=/usr/sbin/riak
bamboo_capability_system_builder_node_Node_js_6=/usr/bin/node
WRAPPER_BITS=32
bamboo_buildKey=INT-BSP32-JOB1
bamboo_repository_233570326_previous_revision_number=4aee8416a4db9dc72d83019acb75a3e10b082720
rvm_loaded_flag=1
bamboo_sonar_token_password=********
rvm_version=1.27.0 (latest)
PWD=/opt/bamboo-home/bin
bamboo_shortJobName=Default Job
bamboo_buildResultsUrl=https://build.spring.io/browse/INT-BSP32-JOB1-46
bamboo_capability_system_builder_gradle___gradlew=./gradlew
bamboo_capability_system_builder_mvn3_Maven_3_3=/opt/maven-3.3
bamboo_capability_system_builder_mvn3_Maven_3_2=/opt/maven-3.2
bamboo_planRepository_repositoryUrl=https://github.com/artembilan/spring-integration.git
bamboo_capability_system_builder_mvn3_Maven_3_1=/opt/maven-3.1
bamboo_repository_233570326_name=Plan Repository
bamboo_capability_system_builder_mvn3_Maven_3_5=/opt/maven-3.5
bamboo_agentId=208568325
MY_RUBY_HOME=/home/bamboo/.rvm/rubies/ruby-2.3.0
bamboo_capability_system_builder_mvn3_Maven_3_0=/opt/maven-3.0
rvm_path=/home/bamboo/.rvm
bamboo_planRepository_revision=29b2c7665b8bc374f25d8d80db926c3095cb31f9
bamboo_planRepository_previousRevision=4aee8416a4db9dc72d83019acb75a3e10b082720
bamboo_capability_remote_build=true
bamboo_repository_233570326_git_branch=FlowContextConcurrency
bamboo_repository_branch_name=FlowContextConcurrency
SHLVL=1
bamboo_scdf_acceptance_tests_password=********
WRAPPER_OS=linux
JAVA_HOME=/opt/jdk-8/
bamboo_dependenciesDisabled=false
EC2_HOME=/opt/ec2-api-tools
XDG_SESSION_ID=c1
bamboo_planRepository_branch=FlowContextConcurrency
bamboo_planRepository_1_type=gitv2
bamboo_planRepository_branchName=FlowContextConcurrency
WRAPPER_FILE_SEPARATOR=/
_=/opt/bamboo-home/bin/bamboo-agent.sh
bamboo_repository_233570326_revision_number=29b2c7665b8bc374f25d8d80db926c3095cb31f9
WRAPPER_PATH_SEPARATOR=:
bamboo_sonar_password=********
bamboo_planRepository_type=gitv2
bamboo_planRepository_1_username=
bamboo_ManualBuildTriggerReason_userName=abilan
bamboo_artifactory_username=buildmaster
rvm_stored_umask=0002
GEM_PATH=/home/bamboo/.rvm/gems/ruby-2.3.0:/home/bamboo/.rvm/gems/ruby-2.3.0@global
bamboo_planKey=INT-BSP32
bamboo_JDK8_HOME=/opt/jdk-8
bamboo_planRepository_username=
NLSPATH=/usr/dt/lib/nls/msg/%L/%N.cat
bamboo_planRepository_1_branchName=FlowContextConcurrency
bamboo_sonar_version=5.6.3
XDG_DATA_DIRS=/usr/local/share:/usr/share:/var/lib/snapd/desktop
bamboo_repository_233570326_git_username=
bamboo_resultsUrl=https://build.spring.io/browse/INT-BSP32-JOB1-46
bamboo_capability_system_jdk_JDK_1_11=/opt/jdk-11
bamboo_capability_system_jdk_JDK_1_10=/opt/jdk-10
bamboo_planRepository_1_name=Plan Repository
bamboo_build_working_directory=/opt/bamboo-home/xml-data/build-dir/INT-BSP32-JOB1
bamboo_capability_system_os=ubuntu1604
bamboo_nexusPush_stagingProfile=buildmaster
bamboo_shortPlanName=SI Test Plan
MAIL=/var/mail/bamboo
bamboo_planRepository_name=Plan Repository
LOGNAME=bamboo
bamboo_buildNumber=46
rvm_user_install_flag=1
SHELL=/bin/bash
bamboo_JDK7_HOME=/opt/jdk-7
bamboo_planName=Spring Integration - SI Test Plan
bamboo_shortPlanKey=BSP32
OLDPWD=/opt/users/bamboo
GEM_HOME=/home/bamboo/.rvm/gems/ruby-2.3.0
bamboo_artifactory_password=********
bamboo_shortJobKey=JOB1
bamboo_repository_previous_revision_number=4aee8416a4db9dc72d83019acb75a3e10b082720
bamboo_buildTimeStamp=2018-05-18T20:56:48.507Z
RUBY_VERSION=ruby-2.3.0
bamboo_sonar_username=buildmaster
_system_name=Ubuntu
bamboo_repository_233570326_branch_name=FlowContextConcurrency
bamboo_buildResultKey=INT-BSP32-JOB1-46
bamboo_repository_233570326_git_repositoryUrl=https://github.com/artembilan/spring-integration.git
bamboo_repository_git_branch=FlowContextConcurrency
bamboo_nexusPush_close=true
bamboo_buildPlanName=Spring Integration - SI Test Plan - Default Job
bamboo_planRepository_1_revision=29b2c7665b8bc374f25d8d80db926c3095cb31f9
_system_arch=x86_64
bamboo_repository_name=Plan Repository
rvm_bin_path=/home/bamboo/.rvm/bin
bamboo_signing_key_password=********
XFILESEARCHPATH=/usr/dt/app-defaults/%L/Dt
rvm_prefix=/home/bamboo
LANG=en_US.UTF-8
bamboo_buildFailed=false
bamboo_capability_system_docker_executable=/usr/bin/docker
DISPLAY=localhost:1.0
bamboo_capability_system_builder_groovy_Groovy_2_4=/opt/groovy-2.4
bamboo_capability_system_builder_command_Bash=/bin/bash
bamboo_agentWorkingDirectory=/opt/bamboo-home/xml-data/build-dir
bamboo_capability_system_git_executable=/usr/bin/git
bamboo_planRepository_1_previousRevision=4aee8416a4db9dc72d83019acb75a3e10b082720
bamboo_repository_git_username=
bamboo_capability_os_family=unix
NVM_NODEJS_ORG_MIRROR=http://nodejs.org/dist
bamboo_planRepository_branchDisplayName=FlowContextConcurrency
NODE_PATH=/usr/lib/nodejs:/usr/lib/node_modules:/usr/share/javascript
bamboo_capability_system_builder_maven_Artifactory_Maven_3_5=/opt/maven-3.5
GIT_SSL_NO_VERIFY=true
bamboo_capability_system_builder_maven_Artifactory_Maven_3_3=/opt/maven-3.3
NVM_DIR=/home/bamboo/.nvm
bamboo_s3_properties=/home/bamboo/tools/s3.properties
bamboo_capability_system_builder_maven_Artifactory_Maven_3_2=/opt/maven-3.2
bamboo_capability_system_builder_maven_Artifactory_Maven_3_1=/opt/maven-3.1
bamboo_capability_system_builder_maven_Artifactory_Maven_3_0=/opt/maven-3.0
_system_type=Linux
bamboo_plan_storageTag=INT-BSP32
_system_version=16.04
USER=bamboo
bamboo_repository_git_repositoryUrl=https://github.com/artembilan/spring-integration.git
bamboo_working_directory=/opt/bamboo-home/xml-data/build-dir/INT-BSP32-JOB1
bamboo_planRepository_1_repositoryUrl=https://github.com/artembilan/spring-integration.git
bamboo_capability_system_jdk_JDK_1_8=/opt/jdk-8
bamboo_capability_system_jdk_JDK_1_9=/opt/jdk-9
WRAPPER_ARCH=x86
bamboo_capability_system_jdk_JDK_1_6=/opt/jdk-6
bamboo_sonar_ip=10.194.6.9
bamboo_capability_system_jdk_JDK_1_7=/opt/jdk-7
XDG_RUNTIME_DIR=/run/user/505
HOME=/home/bamboo
PATH=/bin:/home/bamboo/.rvm/gems/ruby-2.3.0/bin:/home/bamboo/.rvm/gems/ruby-2.3.0@global/bin:/home/bamboo/.rvm/rubies/ruby-2.3.0/bin:/home/bamboo/bin:/usr/local/bin:/usr/bin:/bin:/usr/local/games:/usr/games:/snap/bin:/home/bamboo/bin:/usr/local/bin:/opt/ec2-api-tools/bin:/home/bamboo/.rvm/bin:/bin:/home/bamboo/.rvm/gems/ruby-2.3.0/bin:/home/bamboo/.rvm/gems/ruby-2.3.0@global/bin:/home/bamboo/.rvm/rubies/ruby-2.3.0/bin:/home/bamboo/bin:/usr/local/bin:/usr/bin:/bin:/usr/local/games:/usr/games:/snap/bin:/home/bamboo/bin:/usr/local/bin:/opt/ec2-api-tools/bin:/home/bamboo/.rvm/bin
18-May-2018 20:57:02 Download https://plugins.gradle.org/m2/org/sonarqube/org.sonarqube.gradle.plugin/2.6.2/org.sonarqube.gradle.plugin-2.6.2.pom
18-May-2018 20:57:02 Download https://repo.spring.io/plugins-release/org/jetbrains/kotlin/kotlin-allopen/1.2.41/kotlin-allopen-1.2.41.pom
18-May-2018 20:57:02 Download https://repo.spring.io/plugins-release/org/jetbrains/kotlin/kotlin-gradle-plugin/1.2.41/kotlin-gradle-plugin-1.2.41.pom
18-May-2018 20:57:04 Download https://repo.spring.io/plugins-release/org/sonarsource/scanner/gradle/sonarqube-gradle-plugin/2.6.2/sonarqube-gradle-plugin-2.6.2.pom
18-May-2018 20:57:05
18-May-2018 20:57:05 > Configure project :
18-May-2018 20:57:05 POM relocation to an other version number is not fully supported in Gradle : xml-apis:xml-apis:2.0.2 relocated to xml-apis:xml-apis:1.0.b2.
18-May-2018 20:57:05 Please update your dependency to directly use the correct version 'xml-apis:xml-apis:1.0.b2'.
18-May-2018 20:57:05 Resolution will only pick dependencies of the relocated element.  Artifacts and other metadata will be ignored.
18-May-2018 20:57:06
18-May-2018 20:57:06 Download https://repo.spring.io/plugins-release/org/jetbrains/kotlin/kotlin-allopen/1.2.41/kotlin-allopen-1.2.41.jar
18-May-2018 20:57:06 Download https://repo.spring.io/plugins-release/org/sonarsource/scanner/gradle/sonarqube-gradle-plugin/2.6.2/sonarqube-gradle-plugin-2.6.2.jar
18-May-2018 20:57:13 Download https://repo.spring.io/libs-milestone/com/willowtreeapps/assertk/assertk/0.10/assertk-0.10.pom
18-May-2018 20:57:14 Download https://repo.spring.io/libs-milestone/org/hibernate/hibernate-entitymanager/5.2.16.Final/hibernate-entitymanager-5.2.16.Final.pom
18-May-2018 20:57:14 Download https://repo.spring.io/libs-milestone/org/junit/platform/junit-platform-launcher/1.1.1/junit-platform-launcher-1.1.1.pom
18-May-2018 20:57:14 Download https://repo.spring.io/libs-snapshot/org/springframework/spring-orm/5.1.0.BUILD-SNAPSHOT/maven-metadata.xml
18-May-2018 20:57:14 Download https://repo.spring.io/libs-snapshot/org/springframework/data/spring-data-jpa/2.1.0.BUILD-SNAPSHOT/maven-metadata.xml
18-May-2018 20:57:14 Download https://repo.spring.io/libs-milestone/org/apache/logging/log4j/log4j-jcl/2.11.0/log4j-jcl-2.11.0.pom
18-May-2018 20:57:14 Download https://repo.spring.io/libs-snapshot/org/springframework/data/spring-data-jpa/2.1.0.BUILD-SNAPSHOT/spring-data-jpa-2.1.0.BUILD-20180518.032557-590.pom
18-May-2018 20:57:14 Download https://repo.spring.io/libs-snapshot/org/springframework/spring-orm/5.1.0.BUILD-SNAPSHOT/spring-orm-5.1.0.BUILD-20180518.202419-118.pom
18-May-2018 20:57:14 Download https://repo.spring.io/libs-snapshot/org/springframework/data/build/spring-data-parent/2.1.0.BUILD-SNAPSHOT/maven-metadata.xml
18-May-2018 20:57:15 Download https://repo.spring.io/libs-snapshot/org/springframework/spring-instrument/5.1.0.BUILD-SNAPSHOT/maven-metadata.xml
18-May-2018 20:57:15 Download https://repo.spring.io/libs-snapshot/org/springframework/data/build/spring-data-build/2.1.0.BUILD-SNAPSHOT/maven-metadata.xml
18-May-2018 20:57:15 Download https://repo.spring.io/libs-snapshot/org/springframework/spring-instrument/5.1.0.BUILD-SNAPSHOT/spring-instrument-5.1.0.BUILD-20180518.202419-118.pom
18-May-2018 20:57:16 Download https://repo.spring.io/libs-snapshot/org/springframework/spring-context/5.1.0.BUILD-SNAPSHOT/maven-metadata.xml
18-May-2018 20:57:16 Download https://repo.spring.io/libs-snapshot/org/springframework/spring-aop/5.1.0.BUILD-SNAPSHOT/maven-metadata.xml
18-May-2018 20:57:16 Download https://repo.spring.io/libs-snapshot/org/springframework/spring-messaging/5.1.0.BUILD-SNAPSHOT/maven-metadata.xml
18-May-2018 20:57:16 Download https://repo.spring.io/libs-snapshot/org/springframework/spring-core/5.1.0.BUILD-SNAPSHOT/maven-metadata.xml
18-May-2018 20:57:17 Download https://repo.spring.io/libs-snapshot/org/springframework/spring-messaging/5.1.0.BUILD-SNAPSHOT/spring-messaging-5.1.0.BUILD-20180518.202419-118.pom
18-May-2018 20:57:17 Download https://repo.spring.io/libs-snapshot/io/projectreactor/reactor-core/3.2.0.BUILD-SNAPSHOT/maven-metadata.xml
18-May-2018 20:57:17 Download https://repo.spring.io/libs-snapshot/io/projectreactor/reactor-bom/Californium-BUILD-SNAPSHOT/maven-metadata.xml
18-May-2018 20:57:17 Download https://repo.spring.io/libs-milestone/com/esotericsoftware/kryo-parent/3.0.3/kryo-parent-3.0.3.pom
18-May-2018 20:57:18 Download https://repo.spring.io/libs-snapshot/org/springframework/spring-tx/5.1.0.BUILD-SNAPSHOT/maven-metadata.xml
18-May-2018 20:57:18 Download https://repo.spring.io/libs-snapshot/org/springframework/spring-tx/5.1.0.BUILD-SNAPSHOT/spring-tx-5.1.0.BUILD-20180518.202419-118.pom
18-May-2018 20:57:19 Download https://repo.spring.io/libs-snapshot/org/springframework/spring-jdbc/5.1.0.BUILD-SNAPSHOT/maven-metadata.xml
18-May-2018 20:57:19 Download https://repo.spring.io/libs-snapshot/org/springframework/spring-beans/5.1.0.BUILD-SNAPSHOT/maven-metadata.xml
18-May-2018 20:57:20 Download https://repo.spring.io/libs-snapshot/org/springframework/spring-jdbc/5.1.0.BUILD-SNAPSHOT/spring-jdbc-5.1.0.BUILD-20180518.202419-118.pom
18-May-2018 20:57:20 Download https://repo.spring.io/libs-snapshot/org/springframework/spring-test/5.1.0.BUILD-SNAPSHOT/maven-metadata.xml
18-May-2018 20:57:21 Download https://repo.spring.io/libs-milestone/org/jetbrains/kotlin/kotlin-stdlib/1.1.50/kotlin-stdlib-1.1.50.pom
18-May-2018 20:57:22 Download https://repo.spring.io/libs-snapshot/org/springframework/data/spring-data-commons/2.1.0.BUILD-SNAPSHOT/maven-metadata.xml
18-May-2018 20:57:22 Download https://repo.spring.io/libs-milestone/org/slf4j/slf4j-api/1.8.0-alpha2/slf4j-api-1.8.0-alpha2.pom
18-May-2018 20:57:22 Download https://repo.spring.io/libs-milestone/org/slf4j/slf4j-parent/1.8.0-alpha2/slf4j-parent-1.8.0-alpha2.pom
18-May-2018 20:57:24 Download https://repo.spring.io/libs-snapshot/org/springframework/spring-jcl/5.1.0.BUILD-SNAPSHOT/maven-metadata.xml
18-May-2018 20:57:25 Download https://repo.spring.io/libs-snapshot/org/springframework/spring-expression/5.1.0.BUILD-SNAPSHOT/maven-metadata.xml
18-May-2018 20:57:27 Download https://repo.spring.io/libs-snapshot/org/springframework/data/spring-data-jpa/2.1.0.BUILD-SNAPSHOT/spring-data-jpa-2.1.0.BUILD-20180518.032557-590.jar
18-May-2018 20:57:28 Download https://repo.spring.io/libs-milestone/com/willowtreeapps/assertk/assertk/0.10/assertk-0.10.jar
18-May-2018 20:57:28 Download https://repo.spring.io/libs-snapshot/org/springframework/spring-orm/5.1.0.BUILD-SNAPSHOT/spring-orm-5.1.0.BUILD-20180518.202419-118.jar
18-May-2018 20:57:28 Download https://repo.spring.io/libs-milestone/org/hibernate/hibernate-entitymanager/5.2.16.Final/hibernate-entitymanager-5.2.16.Final.jar
18-May-2018 20:57:28 Download https://repo.spring.io/libs-milestone/org/junit/platform/junit-platform-launcher/1.1.1/junit-platform-launcher-1.1.1.jar
18-May-2018 20:57:28 Download https://repo.spring.io/libs-milestone/org/apache/logging/log4j/log4j-jcl/2.11.0/log4j-jcl-2.11.0.jar
18-May-2018 20:57:29 Download https://repo.spring.io/libs-snapshot/org/springframework/spring-instrument/5.1.0.BUILD-SNAPSHOT/spring-instrument-5.1.0.BUILD-20180518.202419-118.jar
18-May-2018 20:57:29 Download https://repo.spring.io/libs-snapshot/org/springframework/spring-context/5.1.0.BUILD-SNAPSHOT/spring-context-5.1.0.BUILD-20180518.202419-118.jar
18-May-2018 20:57:29 Download https://repo.spring.io/libs-snapshot/org/springframework/spring-aop/5.1.0.BUILD-SNAPSHOT/spring-aop-5.1.0.BUILD-20180518.202419-118.jar
18-May-2018 20:57:30 Download https://repo.spring.io/libs-snapshot/org/springframework/spring-messaging/5.1.0.BUILD-SNAPSHOT/spring-messaging-5.1.0.BUILD-20180518.202419-118.jar
18-May-2018 20:57:30 Download https://repo.spring.io/libs-snapshot/org/springframework/spring-jdbc/5.1.0.BUILD-SNAPSHOT/spring-jdbc-5.1.0.BUILD-20180518.202419-118.jar
18-May-2018 20:57:30 Download https://repo.spring.io/libs-snapshot/org/springframework/spring-tx/5.1.0.BUILD-SNAPSHOT/spring-tx-5.1.0.BUILD-20180518.202419-118.jar
18-May-2018 20:57:31 Download https://repo.spring.io/libs-snapshot/org/springframework/spring-test/5.1.0.BUILD-SNAPSHOT/spring-test-5.1.0.BUILD-20180518.202419-118.jar
18-May-2018 20:57:31 Download https://repo.spring.io/libs-snapshot/org/springframework/spring-beans/5.1.0.BUILD-SNAPSHOT/spring-beans-5.1.0.BUILD-20180518.202419-118.jar
18-May-2018 20:57:31 Download https://repo.spring.io/libs-snapshot/org/springframework/spring-expression/5.1.0.BUILD-SNAPSHOT/spring-expression-5.1.0.BUILD-20180518.202419-118.jar
18-May-2018 20:57:31 Download https://repo.spring.io/libs-snapshot/org/springframework/spring-core/5.1.0.BUILD-SNAPSHOT/spring-core-5.1.0.BUILD-20180518.202419-118.jar
18-May-2018 20:57:32 Download https://repo.spring.io/libs-milestone/org/slf4j/slf4j-api/1.8.0-alpha2/slf4j-api-1.8.0-alpha2.jar
18-May-2018 20:57:33 Download https://repo.spring.io/libs-snapshot/org/springframework/spring-jcl/5.1.0.BUILD-SNAPSHOT/spring-jcl-5.1.0.BUILD-20180518.202419-118.jar
18-May-2018 20:57:33
18-May-2018 20:57:33 > Configure project :
18-May-2018 20:57:33 Attributes found in options. Existing attributes will be replaced due to assignment. Please use 'attributes' method instead as current behaviour will be removed in future
18-May-2018 20:57:35
18-May-2018 20:57:35 > Task :clean
18-May-2018 20:57:35 > Task :spring-integration-amqp:clean UP-TO-DATE
18-May-2018 20:57:35 > Task :spring-integration-bom:clean UP-TO-DATE
18-May-2018 20:57:35 > Task :spring-integration-core:clean UP-TO-DATE
18-May-2018 20:57:35 > Task :spring-integration-event:clean UP-TO-DATE
18-May-2018 20:57:35 > Task :spring-integration-feed:clean UP-TO-DATE
18-May-2018 20:57:35 > Task :spring-integration-file:clean UP-TO-DATE
18-May-2018 20:57:35 > Task :spring-integration-ftp:clean UP-TO-DATE
18-May-2018 20:57:35 > Task :spring-integration-gemfire:clean UP-TO-DATE
18-May-2018 20:57:35 > Task :spring-integration-groovy:clean UP-TO-DATE
18-May-2018 20:57:35 > Task :spring-integration-http:clean UP-TO-DATE
18-May-2018 20:57:35 > Task :spring-integration-ip:clean UP-TO-DATE
18-May-2018 20:57:35 > Task :spring-integration-jdbc:clean UP-TO-DATE
18-May-2018 20:57:35 > Task :spring-integration-jms:clean UP-TO-DATE
18-May-2018 20:57:35 > Task :spring-integration-jmx:clean UP-TO-DATE
18-May-2018 20:57:35 > Task :spring-integration-jpa:clean UP-TO-DATE
18-May-2018 20:57:35 > Task :spring-integration-mail:clean UP-TO-DATE
18-May-2018 20:57:35 > Task :spring-integration-mongodb:clean UP-TO-DATE
18-May-2018 20:57:35 > Task :spring-integration-mqtt:clean UP-TO-DATE
18-May-2018 20:57:35 > Task :spring-integration-redis:clean UP-TO-DATE
18-May-2018 20:57:35 > Task :spring-integration-rmi:clean UP-TO-DATE
18-May-2018 20:57:35 > Task :spring-integration-scripting:clean UP-TO-DATE
18-May-2018 20:57:35 > Task :spring-integration-security:clean UP-TO-DATE
18-May-2018 20:57:35 > Task :spring-integration-sftp:clean UP-TO-DATE
18-May-2018 20:57:35 > Task :spring-integration-stomp:clean UP-TO-DATE
18-May-2018 20:57:35 > Task :spring-integration-stream:clean UP-TO-DATE
18-May-2018 20:57:35 > Task :spring-integration-syslog:clean UP-TO-DATE
18-May-2018 20:57:35 > Task :spring-integration-test:clean UP-TO-DATE
18-May-2018 20:57:35 > Task :spring-integration-test-support:clean UP-TO-DATE
18-May-2018 20:57:35 > Task :spring-integration-twitter:clean UP-TO-DATE
18-May-2018 20:57:35 > Task :spring-integration-webflux:clean UP-TO-DATE
18-May-2018 20:57:35 > Task :spring-integration-websocket:clean UP-TO-DATE
18-May-2018 20:57:35 > Task :spring-integration-ws:clean UP-TO-DATE
18-May-2018 20:57:35 > Task :spring-integration-xml:clean UP-TO-DATE
18-May-2018 20:57:35 > Task :spring-integration-xmpp:clean UP-TO-DATE
18-May-2018 20:57:35 > Task :spring-integration-zookeeper:clean UP-TO-DATE
18-May-2018 20:57:35 > Task :check UP-TO-DATE
18-May-2018 20:57:38 > Task :spring-integration-core:compileKotlin
18-May-2018 20:57:41
18-May-2018 20:57:41 > Task :spring-integration-core:compileJava
18-May-2018 20:57:41 /opt/users/bamboo/.gradle/caches/modules-2/files-2.1/org.springframework/spring-core/5.1.0.BUILD-SNAPSHOT/da30186843b2860555174342191b888f544ff451/spring-core-5.1.0.BUILD-SNAPSHOT.jar(org/springframework/lang/Nullable.class): warning: Cannot find annotation method 'when()' in type 'Nonnull': class file for javax.annotation.Nonnull not found
18-May-2018 20:57:41 warning: unknown enum constant When.MAYBE
18-May-2018 20:57:41   reason: class file for javax.annotation.meta.When not found
18-May-2018 20:57:46 2 warnings
18-May-2018 20:57:46
18-May-2018 20:57:46 > Task :spring-integration-core:processResources
18-May-2018 20:57:46 > Task :spring-integration-core:classes
18-May-2018 20:57:46 > Task :spring-integration-core:jar
18-May-2018 20:57:47 Download https://repo.spring.io/libs-snapshot/org/springframework/amqp/spring-rabbit/2.1.0.BUILD-SNAPSHOT/maven-metadata.xml
18-May-2018 20:57:47 Download https://repo.spring.io/libs-snapshot/org/springframework/amqp/spring-rabbit/2.1.0.BUILD-SNAPSHOT/spring-rabbit-2.1.0.BUILD-20180517.131803-23.pom
18-May-2018 20:57:47 Download https://repo.spring.io/libs-milestone/com/rabbitmq/amqp-client/5.2.0/amqp-client-5.2.0.pom
18-May-2018 20:57:47 Download https://repo.spring.io/libs-snapshot/org/springframework/amqp/spring-amqp/2.1.0.BUILD-SNAPSHOT/maven-metadata.xml
18-May-2018 20:57:47 Download https://repo.spring.io/libs-snapshot/org/springframework/spring-web/5.1.0.BUILD-SNAPSHOT/maven-metadata.xml
18-May-2018 20:57:47 Download https://repo.spring.io/libs-snapshot/org/springframework/amqp/spring-amqp/2.1.0.BUILD-SNAPSHOT/spring-amqp-2.1.0.BUILD-20180517.131803-23.pom
18-May-2018 20:57:48 Download https://repo.spring.io/libs-milestone/io/projectreactor/ipc/reactor-netty/0.7.1.RELEASE/reactor-netty-0.7.1.RELEASE.pom
18-May-2018 20:57:48 Download https://repo.spring.io/libs-milestone/org/springframework/spring-webflux/5.0.1.RELEASE/spring-webflux-5.0.1.RELEASE.pom
18-May-2018 20:57:49 Download https://repo.spring.io/libs-milestone/io/netty/netty-handler-proxy/4.1.16.Final/netty-handler-proxy-4.1.16.Final.pom
18-May-2018 20:57:49 Download https://repo.spring.io/libs-milestone/io/netty/netty-transport-native-epoll/4.1.16.Final/netty-transport-native-epoll-4.1.16.Final.pom
18-May-2018 20:57:49 Download https://repo.spring.io/libs-milestone/io/netty/netty-codec-socks/4.1.16.Final/netty-codec-socks-4.1.16.Final.pom
18-May-2018 20:57:49 Download https://repo.spring.io/libs-milestone/io/netty/netty-transport-native-unix-common/4.1.16.Final/netty-transport-native-unix-common-4.1.16.Final.pom
18-May-2018 20:57:50 Download https://repo.spring.io/libs-snapshot/org/springframework/amqp/spring-amqp/2.1.0.BUILD-SNAPSHOT/spring-amqp-2.1.0.BUILD-20180517.131803-23.jar
18-May-2018 20:57:50 Download https://repo.spring.io/libs-milestone/io/projectreactor/ipc/reactor-netty/0.7.1.RELEASE/reactor-netty-0.7.1.RELEASE.jar
18-May-2018 20:57:50 Download https://repo.spring.io/libs-snapshot/org/springframework/amqp/spring-rabbit/2.1.0.BUILD-SNAPSHOT/spring-rabbit-2.1.0.BUILD-20180517.131803-23.jar
18-May-2018 20:57:50 Download https://repo.spring.io/libs-milestone/com/rabbitmq/amqp-client/5.2.0/amqp-client-5.2.0.jar
18-May-2018 20:57:50 Download https://repo.spring.io/libs-snapshot/org/springframework/spring-web/5.1.0.BUILD-SNAPSHOT/spring-web-5.1.0.BUILD-20180518.202419-118.jar
18-May-2018 20:57:50 Download https://repo.spring.io/libs-milestone/io/netty/netty-handler-proxy/4.1.16.Final/netty-handler-proxy-4.1.16.Final.jar
18-May-2018 20:57:50 Download https://repo.spring.io/libs-milestone/io/netty/netty-transport-native-epoll/4.1.16.Final/netty-transport-native-epoll-4.1.16.Final.jar
18-May-2018 20:57:50 Download https://repo.spring.io/libs-milestone/io/netty/netty-codec-socks/4.1.16.Final/netty-codec-socks-4.1.16.Final.jar
18-May-2018 20:57:50 Download https://repo.spring.io/libs-milestone/io/netty/netty-transport-native-unix-common/4.1.16.Final/netty-transport-native-unix-common-4.1.16.Final.jar
18-May-2018 20:57:51 Download https://repo.spring.io/libs-milestone/org/springframework/spring-webflux/5.0.1.RELEASE/spring-webflux-5.0.1.RELEASE.jar
18-May-2018 20:57:51 > Task :spring-integration-amqp:compileKotlin
18-May-2018 20:57:53
18-May-2018 20:57:53 > Task :spring-integration-amqp:compileJava
18-May-2018 20:57:53 /opt/users/bamboo/.gradle/caches/modules-2/files-2.1/org.springframework/spring-core/5.1.0.BUILD-SNAPSHOT/da30186843b2860555174342191b888f544ff451/spring-core-5.1.0.BUILD-SNAPSHOT.jar(org/springframework/lang/Nullable.class): warning: Cannot find annotation method 'when()' in type 'Nonnull': class file for javax.annotation.Nonnull not found
18-May-2018 20:57:53 warning: unknown enum constant When.MAYBE
18-May-2018 20:57:53   reason: class file for javax.annotation.meta.When not found
18-May-2018 20:57:53 2 warnings
18-May-2018 20:57:53
18-May-2018 20:57:53 > Task :spring-integration-amqp:processResources
18-May-2018 20:57:53 > Task :spring-integration-amqp:classes
18-May-2018 20:57:53 Download https://repo.spring.io/libs-milestone/com/puppycrawl/tools/checkstyle/8.9/checkstyle-8.9.pom
18-May-2018 20:57:53 Download https://repo.spring.io/libs-milestone/com/google/guava/guava/24.1-jre/guava-24.1-jre.pom
18-May-2018 20:57:53 Download https://repo.spring.io/libs-milestone/org/antlr/antlr4-runtime/4.7.1/antlr4-runtime-4.7.1.pom
18-May-2018 20:57:53 Download https://repo.spring.io/libs-milestone/com/google/guava/guava-parent/24.1-jre/guava-parent-24.1-jre.pom
18-May-2018 20:57:53 Download https://repo.spring.io/libs-milestone/org/antlr/antlr4-master/4.7.1/antlr4-master-4.7.1.pom
18-May-2018 20:57:53 Download https://repo.spring.io/libs-milestone/net/sf/saxon/Saxon-HE/9.8.0-10/Saxon-HE-9.8.0-10.pom
18-May-2018 20:57:54 Download https://repo.spring.io/libs-milestone/org/antlr/antlr4-runtime/4.7.1/antlr4-runtime-4.7.1.jar
18-May-2018 20:57:54 Download https://repo.spring.io/libs-milestone/com/puppycrawl/tools/checkstyle/8.9/checkstyle-8.9.jar
18-May-2018 20:57:54 Download https://repo.spring.io/libs-milestone/net/sf/saxon/Saxon-HE/9.8.0-10/Saxon-HE-9.8.0-10.jar
18-May-2018 20:57:55 Download https://repo.spring.io/libs-milestone/com/google/guava/guava/24.1-jre/guava-24.1-jre.jar
18-May-2018 20:57:59 > Task :spring-integration-amqp:checkstyleMain
18-May-2018 20:57:59 > Task :spring-integration-stream:compileKotlin
18-May-2018 20:57:59 > Task :spring-integration-stream:compileJava
18-May-2018 20:57:59 > Task :spring-integration-stream:processResources
18-May-2018 20:57:59 > Task :spring-integration-stream:classes
18-May-2018 20:57:59 > Task :spring-integration-stream:jar
18-May-2018 20:57:59 > Task :spring-integration-test-support:compileKotlin
18-May-2018 20:58:01 > Task :spring-integration-test-support:compileJava
18-May-2018 20:58:01 > Task :spring-integration-test-support:processResources NO-SOURCE
18-May-2018 20:58:01 > Task :spring-integration-test-support:classes
18-May-2018 20:58:01 > Task :spring-integration-test-support:jar
18-May-2018 20:58:02 Download https://repo.spring.io/libs-snapshot/org/springframework/amqp/spring-rabbit-junit/2.1.0.BUILD-SNAPSHOT/maven-metadata.xml
18-May-2018 20:58:02 Download https://repo.spring.io/libs-snapshot/org/springframework/amqp/spring-rabbit-junit/2.1.0.BUILD-SNAPSHOT/spring-rabbit-junit-2.1.0.BUILD-20180517.131803-23.pom
18-May-2018 20:58:02 Download https://repo.spring.io/libs-snapshot/org/springframework/amqp/spring-rabbit-junit/2.1.0.BUILD-SNAPSHOT/spring-rabbit-junit-2.1.0.BUILD-20180517.131803-23.jar
18-May-2018 20:58:02 > Task :spring-integration-amqp:compileTestKotlin
18-May-2018 20:58:03 > Task :spring-integration-amqp:compileTestJava
18-May-2018 20:58:03 > Task :spring-integration-amqp:processTestResources
18-May-2018 20:58:03 > Task :spring-integration-amqp:testClasses
18-May-2018 20:58:04 > Task :spring-integration-amqp:checkstyleTest
18-May-2018 20:58:06
18-May-2018 20:58:06 > Task :spring-integration-core:javadoc
18-May-2018 20:58:06 warning: unknown enum constant When.MAYBE
18-May-2018 20:58:06   reason: class file for javax.annotation.meta.When not found
18-May-2018 20:58:14 1 warning
18-May-2018 20:58:17
18-May-2018 20:58:17 > Task :spring-integration-amqp:javadoc
18-May-2018 20:58:17 warning: unknown enum constant When.MAYBE
18-May-2018 20:58:17   reason: class file for javax.annotation.meta.When not found
18-May-2018 20:58:17 1 warning
18-May-2018 20:58:18
18-May-2018 20:58:18 > Task :spring-integration-amqp:checkTestConfigs
18-May-2018 20:58:48 > Task :spring-integration-amqp:test
18-May-2018 20:58:48 > Task :spring-integration-amqp:check
18-May-2018 20:58:48 > Task :spring-integration-bom:compileKotlin NO-SOURCE
18-May-2018 20:58:48 > Task :spring-integration-bom:compileJava NO-SOURCE
18-May-2018 20:58:48 > Task :spring-integration-bom:processResources NO-SOURCE
18-May-2018 20:58:48 > Task :spring-integration-bom:classes UP-TO-DATE
18-May-2018 20:58:48 > Task :spring-integration-bom:checkstyleMain NO-SOURCE
18-May-2018 20:58:48 > Task :spring-integration-bom:compileTestKotlin NO-SOURCE
18-May-2018 20:58:48 > Task :spring-integration-bom:compileTestJava NO-SOURCE
18-May-2018 20:58:48 > Task :spring-integration-bom:processTestResources NO-SOURCE
18-May-2018 20:58:48 > Task :spring-integration-bom:testClasses UP-TO-DATE
18-May-2018 20:58:48 > Task :spring-integration-bom:checkstyleTest NO-SOURCE
18-May-2018 20:58:48 > Task :spring-integration-bom:javadoc NO-SOURCE
18-May-2018 20:58:48 > Task :spring-integration-bom:checkTestConfigs
18-May-2018 20:58:48 > Task :spring-integration-bom:test NO-SOURCE
18-May-2018 20:58:48 > Task :spring-integration-bom:check UP-TO-DATE
18-May-2018 20:58:55 > Task :spring-integration-core:checkstyleMain
18-May-2018 20:58:55 Download https://repo.spring.io/libs-milestone/org/aspectj/aspectjweaver/1.9.0/aspectjweaver-1.9.0.pom
18-May-2018 20:58:55 Download https://repo.spring.io/libs-snapshot/io/projectreactor/reactor-test/3.2.0.BUILD-SNAPSHOT/maven-metadata.xml
18-May-2018 20:58:55 Download https://repo.spring.io/libs-milestone/org/aspectj/aspectjweaver/1.9.0/aspectjweaver-1.9.0.jar
18-May-2018 20:59:02 > Task :spring-integration-core:compileTestKotlin
18-May-2018 20:59:05
18-May-2018 20:59:05 > Task :spring-integration-core:compileTestJava
18-May-2018 20:59:05 /opt/users/bamboo/.gradle/caches/modules-2/files-2.1/org.springframework/spring-core/5.1.0.BUILD-SNAPSHOT/da30186843b2860555174342191b888f544ff451/spring-core-5.1.0.BUILD-SNAPSHOT.jar(org/springframework/lang/Nullable.class): warning: Cannot find annotation method 'when()' in type 'Nonnull': class file for javax.annotation.Nonnull not found
18-May-2018 20:59:05 warning: unknown enum constant When.MAYBE
18-May-2018 20:59:05   reason: class file for javax.annotation.meta.When not found
18-May-2018 20:59:05 /opt/users/bamboo/.gradle/caches/modules-2/files-2.1/org.springframework/spring-core/5.1.0.BUILD-SNAPSHOT/da30186843b2860555174342191b888f544ff451/spring-core-5.1.0.BUILD-SNAPSHOT.jar(org/springframework/lang/Nullable.class): warning: Cannot find annotation method 'when()' in type 'Nonnull': class file for javax.annotation.Nonnull not found
18-May-2018 20:59:05 warning: unknown enum constant When.MAYBE
18-May-2018 20:59:05   reason: class file for javax.annotation.meta.When not found
18-May-2018 20:59:05 /opt/users/bamboo/.gradle/caches/modules-2/files-2.1/org.springframework/spring-core/5.1.0.BUILD-SNAPSHOT/da30186843b2860555174342191b888f544ff451/spring-core-5.1.0.BUILD-SNAPSHOT.jar(org/springframework/lang/Nullable.class): warning: Cannot find annotation method 'when()' in type 'Nonnull': class file for javax.annotation.Nonnull not found
18-May-2018 20:59:05 warning: unknown enum constant When.MAYBE
18-May-2018 20:59:05   reason: class file for javax.annotation.meta.When not found
18-May-2018 20:59:10 6 warnings
18-May-2018 20:59:11
18-May-2018 20:59:11 > Task :spring-integration-core:processTestResources
18-May-2018 20:59:11 > Task :spring-integration-core:testClasses
18-May-2018 20:59:17 > Task :spring-integration-core:checkstyleTest
18-May-2018 20:59:18 > Task :spring-integration-core:checkTestConfigs
18-May-2018 20:59:48 > Task :spring-integration-core:test
18-May-2018 20:59:51 *** java.lang.instrument ASSERTION FAILED ***: "!errorOutstanding" with message transform method call failed at JPLISAgent.c line: 844
18-May-2018 20:59:51 *** java.lang.instrument ASSERTION FAILED ***: "!errorOutstanding" with message transform method call failed at JPLISAgent.c line: 844
18-May-2018 20:59:51 *** java.lang.instrument ASSERTION FAILED ***: "!errorOutstanding" with message transform method call failed at JPLISAgent.c line: 844
18-May-2018 20:59:51 *** java.lang.instrument ASSERTION FAILED ***: "!errorOutstanding" with message transform method call failed at JPLISAgent.c line: 844
18-May-2018 21:01:07
18-May-2018 21:01:07 > Task :spring-integration-core:check
18-May-2018 21:01:07 > Task :spring-integration-event:compileKotlin
18-May-2018 21:01:07 > Task :spring-integration-event:compileJava
18-May-2018 21:01:07 > Task :spring-integration-event:processResources
18-May-2018 21:01:07 > Task :spring-integration-event:classes
18-May-2018 21:01:08 > Task :spring-integration-event:checkstyleMain
18-May-2018 21:01:08 > Task :spring-integration-event:compileTestKotlin
18-May-2018 21:01:08 > Task :spring-integration-event:compileTestJava
18-May-2018 21:01:08 > Task :spring-integration-event:processTestResources
18-May-2018 21:01:08 > Task :spring-integration-event:testClasses
18-May-2018 21:01:08 > Task :spring-integration-event:checkstyleTest
18-May-2018 21:01:10 > Task :spring-integration-event:javadoc
18-May-2018 21:01:10 > Task :spring-integration-event:checkTestConfigs
18-May-2018 21:01:16 > Task :spring-integration-event:test
18-May-2018 21:01:16 > Task :spring-integration-event:check
18-May-2018 21:01:17 > Task :spring-integration-feed:compileKotlin
18-May-2018 21:01:17 > Task :spring-integration-feed:compileJava
18-May-2018 21:01:17 > Task :spring-integration-feed:processResources
18-May-2018 21:01:17 > Task :spring-integration-feed:classes
18-May-2018 21:01:17 > Task :spring-integration-feed:checkstyleMain
18-May-2018 21:01:17 > Task :spring-integration-feed:compileTestKotlin
18-May-2018 21:01:17 > Task :spring-integration-feed:compileTestJava
18-May-2018 21:01:17 > Task :spring-integration-feed:processTestResources
18-May-2018 21:01:17 > Task :spring-integration-feed:testClasses
18-May-2018 21:01:18 > Task :spring-integration-feed:checkstyleTest
18-May-2018 21:01:19 > Task :spring-integration-feed:javadoc
18-May-2018 21:01:19 > Task :spring-integration-feed:checkTestConfigs
18-May-2018 21:01:27 > Task :spring-integration-feed:test
18-May-2018 21:01:27 > Task :spring-integration-feed:check
18-May-2018 21:01:27 > Task :spring-integration-file:compileKotlin
18-May-2018 21:01:28 > Task :spring-integration-file:compileJava
18-May-2018 21:01:28 > Task :spring-integration-file:processResources
18-May-2018 21:01:28 > Task :spring-integration-file:classes
18-May-2018 21:01:29 > Task :spring-integration-file:checkstyleMain
18-May-2018 21:01:29 Download https://repo.spring.io/libs-snapshot/org/springframework/data/spring-data-geode/2.1.0.BUILD-SNAPSHOT/maven-metadata.xml
18-May-2018 21:01:29 Download https://repo.spring.io/libs-snapshot/org/springframework/data/spring-data-geode/2.1.0.BUILD-SNAPSHOT/spring-data-geode-2.1.0.BUILD-20180518.032557-546.pom
18-May-2018 21:01:32 Download https://repo.spring.io/libs-snapshot/org/springframework/data/spring-data-geode/2.1.0.BUILD-SNAPSHOT/spring-data-geode-2.1.0.BUILD-20180518.032557-546.jar
18-May-2018 21:01:36 > Task :spring-integration-gemfire:compileKotlin
18-May-2018 21:01:40 > Task :spring-integration-gemfire:compileJava
18-May-2018 21:01:40 > Task :spring-integration-gemfire:processResources
18-May-2018 21:01:40 > Task :spring-integration-gemfire:classes
18-May-2018 21:01:40 > Task :spring-integration-gemfire:jar
18-May-2018 21:01:41 > Task :spring-integration-jdbc:compileKotlin
18-May-2018 21:01:42 > Task :spring-integration-jdbc:compileJava
18-May-2018 21:01:42 > Task :spring-integration-jdbc:processResources
18-May-2018 21:01:42 > Task :spring-integration-jdbc:classes
18-May-2018 21:01:42 > Task :spring-integration-jdbc:jar
18-May-2018 21:01:42 Download https://repo.spring.io/libs-snapshot/org/springframework/data/spring-data-redis/2.1.0.BUILD-SNAPSHOT/maven-metadata.xml
18-May-2018 21:01:42 Download https://repo.spring.io/libs-snapshot/org/springframework/data/spring-data-redis/2.1.0.BUILD-SNAPSHOT/spring-data-redis-2.1.0.BUILD-20180518.032715-564.pom
18-May-2018 21:01:43 Download https://repo.spring.io/libs-snapshot/org/springframework/data/spring-data-keyvalue/2.1.0.BUILD-SNAPSHOT/maven-metadata.xml
18-May-2018 21:01:43 Download https://repo.spring.io/libs-snapshot/org/springframework/data/spring-data-keyvalue/2.1.0.BUILD-SNAPSHOT/spring-data-keyvalue-2.1.0.BUILD-20180518.032558-549.pom
18-May-2018 21:01:43 Download https://repo.spring.io/libs-snapshot/org/springframework/data/spring-data-redis/2.1.0.BUILD-SNAPSHOT/spring-data-redis-2.1.0.BUILD-20180518.032715-564.jar
18-May-2018 21:01:43 Download https://repo.spring.io/libs-snapshot/org/springframework/data/spring-data-keyvalue/2.1.0.BUILD-SNAPSHOT/spring-data-keyvalue-2.1.0.BUILD-20180518.032558-549.jar
18-May-2018 21:01:43 > Task :spring-integration-redis:compileKotlin
18-May-2018 21:01:44 > Task :spring-integration-redis:compileJava
18-May-2018 21:01:44 > Task :spring-integration-redis:processResources
18-May-2018 21:01:44 > Task :spring-integration-redis:classes
18-May-2018 21:01:45 > Task :spring-integration-redis:compileTestKotlin
18-May-2018 21:01:45 > Task :spring-integration-redis:jar
18-May-2018 21:01:46 > Task :spring-integration-redis:compileTestJava
18-May-2018 21:01:46 > Task :spring-integration-redis:processTestResources
18-May-2018 21:01:46 > Task :spring-integration-redis:testClasses
18-May-2018 21:01:46 > Task :spring-integration-file:compileTestKotlin
18-May-2018 21:01:47 > Task :spring-integration-file:compileTestJava
18-May-2018 21:01:48 > Task :spring-integration-file:processTestResources
18-May-2018 21:01:48 > Task :spring-integration-file:testClasses
18-May-2018 21:01:49 > Task :spring-integration-file:checkstyleTest
18-May-2018 21:01:52 > Task :spring-integration-file:javadoc
18-May-2018 21:01:52 > Task :spring-integration-file:checkTestConfigs
18-May-2018 21:02:22 > Task :spring-integration-file:test
18-May-2018 21:02:27 > Task :spring-integration-file:check
18-May-2018 21:02:27 > Task :spring-integration-file:jar
18-May-2018 21:02:27 Download https://repo.spring.io/libs-snapshot/org/springframework/spring-context-support/5.1.0.BUILD-SNAPSHOT/maven-metadata.xml
18-May-2018 21:02:28 Download https://repo.spring.io/libs-snapshot/org/springframework/spring-context-support/5.1.0.BUILD-SNAPSHOT/spring-context-support-5.1.0.BUILD-20180518.202419-118.pom
18-May-2018 21:02:28 Download https://repo.spring.io/libs-snapshot/org/springframework/spring-context-support/5.1.0.BUILD-SNAPSHOT/spring-context-support-5.1.0.BUILD-20180518.202419-118.jar
18-May-2018 21:02:28 > Task :spring-integration-ftp:compileKotlin
18-May-2018 21:02:29 > Task :spring-integration-ftp:compileJava
18-May-2018 21:02:29 > Task :spring-integration-ftp:processResources
18-May-2018 21:02:29 > Task :spring-integration-ftp:classes
18-May-2018 21:02:29 > Task :spring-integration-ftp:checkstyleMain
18-May-2018 21:02:29 Download https://repo.spring.io/libs-milestone/org/apache/ftpserver/ftpserver-core/1.1.1/ftpserver-core-1.1.1.pom
18-May-2018 21:02:29 Download https://repo.spring.io/libs-milestone/org/apache/ftpserver/ftpserver-parent/1.1.1/ftpserver-parent-1.1.1.pom
18-May-2018 21:02:29 Download https://repo.spring.io/libs-milestone/org/apache/ftpserver/ftplet-api/1.1.1/ftplet-api-1.1.1.pom
18-May-2018 21:02:29 Download https://repo.spring.io/libs-milestone/org/apache/mina/mina-core/2.0.16/mina-core-2.0.16.pom
18-May-2018 21:02:29 Download https://repo.spring.io/libs-milestone/org/apache/mina/mina-parent/2.0.16/mina-parent-2.0.16.pom
18-May-2018 21:02:29 Download https://repo.spring.io/libs-milestone/org/apache/ftpserver/ftpserver-core/1.1.1/ftpserver-core-1.1.1.jar
18-May-2018 21:02:29 Download https://repo.spring.io/libs-milestone/org/apache/mina/mina-core/2.0.16/mina-core-2.0.16.jar
18-May-2018 21:02:29 Download https://repo.spring.io/libs-milestone/org/apache/ftpserver/ftplet-api/1.1.1/ftplet-api-1.1.1.jar
18-May-2018 21:02:30 > Task :spring-integration-ftp:compileTestKotlin
18-May-2018 21:02:30 > Task :spring-integration-ftp:compileTestJava
18-May-2018 21:02:30 > Task :spring-integration-ftp:processTestResources
18-May-2018 21:02:30 > Task :spring-integration-ftp:testClasses
18-May-2018 21:02:31 > Task :spring-integration-ftp:checkstyleTest
18-May-2018 21:02:33 > Task :spring-integration-ftp:javadoc
18-May-2018 21:02:33 > Task :spring-integration-ftp:checkTestConfigs
18-May-2018 21:02:57 > Task :spring-integration-ftp:test
18-May-2018 21:02:57 > Task :spring-integration-ftp:check
18-May-2018 21:02:57 > Task :spring-integration-gemfire:checkstyleMain
18-May-2018 21:02:57 > Task :spring-integration-gemfire:compileTestKotlin
18-May-2018 21:02:58 > Task :spring-integration-gemfire:compileTestJava
18-May-2018 21:02:58 > Task :spring-integration-gemfire:processTestResources
18-May-2018 21:02:58 > Task :spring-integration-gemfire:testClasses
18-May-2018 21:02:58 > Task :spring-integration-gemfire:checkstyleTest
18-May-2018 21:03:00 > Task :spring-integration-gemfire:javadoc
18-May-2018 21:03:00 > Task :spring-integration-gemfire:checkTestConfigs
18-May-2018 21:03:17 > Task :spring-integration-gemfire:test
18-May-2018 21:03:17 > Task :spring-integration-gemfire:check
18-May-2018 21:03:17 > Task :spring-integration-scripting:compileKotlin
18-May-2018 21:03:17 > Task :spring-integration-scripting:compileJava
18-May-2018 21:03:17 > Task :spring-integration-scripting:processResources
18-May-2018 21:03:17 > Task :spring-integration-scripting:classes
18-May-2018 21:03:17 > Task :spring-integration-scripting:jar
18-May-2018 21:03:18 > Task :spring-integration-groovy:compileKotlin
18-May-2018 21:03:19 > Task :spring-integration-groovy:compileJava
18-May-2018 21:03:19 > Task :spring-integration-groovy:processResources
18-May-2018 21:03:19 > Task :spring-integration-groovy:classes
18-May-2018 21:03:19 > Task :spring-integration-groovy:checkstyleMain
18-May-2018 21:03:19 > Task :spring-integration-groovy:compileTestKotlin
18-May-2018 21:03:19 > Task :spring-integration-groovy:compileTestJava
18-May-2018 21:03:19 > Task :spring-integration-groovy:processTestResources
18-May-2018 21:03:19 > Task :spring-integration-groovy:testClasses
18-May-2018 21:03:19 > Task :spring-integration-groovy:checkstyleTest
18-May-2018 21:03:21 > Task :spring-integration-scripting:javadoc
18-May-2018 21:03:22 > Task :spring-integration-groovy:javadoc
18-May-2018 21:03:22 > Task :spring-integration-groovy:checkTestConfigs
18-May-2018 21:03:39 > Task :spring-integration-groovy:test
18-May-2018 21:03:39 > Task :spring-integration-groovy:check
18-May-2018 21:03:39 Download https://repo.spring.io/libs-milestone/javax/servlet/javax.servlet-api/4.0.0/javax.servlet-api-4.0.0.pom
18-May-2018 21:03:40 Download https://repo.spring.io/libs-snapshot/org/springframework/spring-webmvc/5.1.0.BUILD-SNAPSHOT/maven-metadata.xml
18-May-2018 21:03:44 Download https://repo.spring.io/libs-milestone/javax/servlet/javax.servlet-api/4.0.0/javax.servlet-api-4.0.0.jar
18-May-2018 21:03:44 Download https://repo.spring.io/libs-snapshot/org/springframework/spring-webmvc/5.1.0.BUILD-SNAPSHOT/spring-webmvc-5.1.0.BUILD-20180518.202419-118.jar
18-May-2018 21:03:44 > Task :spring-integration-http:compileKotlin
18-May-2018 21:03:45 > Task :spring-integration-http:compileJava
18-May-2018 21:03:45 > Task :spring-integration-http:processResources
18-May-2018 21:03:45 > Task :spring-integration-http:classes
18-May-2018 21:03:45 > Task :spring-integration-http:checkstyleMain
18-May-2018 21:03:46 Download https://repo.spring.io/libs-snapshot/org/springframework/security/spring-security-core/5.1.0.BUILD-SNAPSHOT/maven-metadata.xml
18-May-2018 21:03:46 Download https://repo.spring.io/libs-snapshot/org/springframework/security/spring-security-core/5.1.0.BUILD-SNAPSHOT/spring-security-core-5.1.0.BUILD-20180518.183652-159.pom
18-May-2018 21:03:46 Download https://repo.spring.io/libs-snapshot/org/springframework/security/spring-security-core/5.1.0.BUILD-SNAPSHOT/spring-security-core-5.1.0.BUILD-20180518.183652-159.jar
18-May-2018 21:03:47 > Task :spring-integration-security:compileKotlin
18-May-2018 21:03:47 > Task :spring-integration-security:compileJava
18-May-2018 21:03:47 > Task :spring-integration-security:processResources
18-May-2018 21:03:47 > Task :spring-integration-security:classes
18-May-2018 21:03:47 > Task :spring-integration-security:jar
18-May-2018 21:03:47 Download https://repo.spring.io/libs-snapshot/org/springframework/security/spring-security-test/5.1.0.BUILD-SNAPSHOT/maven-metadata.xml
18-May-2018 21:03:47 Download https://repo.spring.io/libs-snapshot/org/springframework/security/spring-security-config/5.1.0.BUILD-SNAPSHOT/maven-metadata.xml
18-May-2018 21:03:47 Download https://repo.spring.io/libs-snapshot/org/springframework/security/spring-security-test/5.1.0.BUILD-SNAPSHOT/spring-security-test-5.1.0.BUILD-20180518.183652-159.pom
18-May-2018 21:03:47 Download https://repo.spring.io/libs-snapshot/org/springframework/security/spring-security-config/5.1.0.BUILD-SNAPSHOT/spring-security-config-5.1.0.BUILD-20180518.183652-159.pom
18-May-2018 21:03:48 Download https://repo.spring.io/libs-snapshot/org/springframework/security/spring-security-web/5.1.0.BUILD-SNAPSHOT/maven-metadata.xml
18-May-2018 21:03:48 Download https://repo.spring.io/libs-snapshot/org/springframework/security/spring-security-web/5.1.0.BUILD-SNAPSHOT/spring-security-web-5.1.0.BUILD-20180518.183652-159.pom
18-May-2018 21:03:48 Download https://repo.spring.io/libs-snapshot/org/springframework/security/spring-security-config/5.1.0.BUILD-SNAPSHOT/spring-security-config-5.1.0.BUILD-20180518.183652-159.jar
18-May-2018 21:03:48 Download https://repo.spring.io/libs-snapshot/org/springframework/security/spring-security-test/5.1.0.BUILD-SNAPSHOT/spring-security-test-5.1.0.BUILD-20180518.183652-159.jar
18-May-2018 21:03:48 Download https://repo.spring.io/libs-snapshot/org/springframework/security/spring-security-web/5.1.0.BUILD-SNAPSHOT/spring-security-web-5.1.0.BUILD-20180518.183652-159.jar
18-May-2018 21:03:48 > Task :spring-integration-http:compileTestKotlin
18-May-2018 21:03:49 > Task :spring-integration-http:compileTestJava
18-May-2018 21:03:49 > Task :spring-integration-http:processTestResources
18-May-2018 21:03:49 > Task :spring-integration-http:testClasses
18-May-2018 21:03:50 > Task :spring-integration-http:checkstyleTest
18-May-2018 21:03:52 > Task :spring-integration-http:javadoc
18-May-2018 21:03:52 > Task :spring-integration-http:checkTestConfigs
18-May-2018 21:04:07 > Task :spring-integration-http:test
18-May-2018 21:04:07 > Task :spring-integration-http:check
18-May-2018 21:04:07 > Task :spring-integration-ip:compileKotlin
18-May-2018 21:04:08
18-May-2018 21:04:08 > Task :spring-integration-ip:compileJava
18-May-2018 21:04:08 /opt/users/bamboo/.gradle/caches/modules-2/files-2.1/org.springframework/spring-core/5.1.0.BUILD-SNAPSHOT/da30186843b2860555174342191b888f544ff451/spring-core-5.1.0.BUILD-SNAPSHOT.jar(org/springframework/lang/Nullable.class): warning: Cannot find annotation method 'when()' in type 'Nonnull': class file for javax.annotation.Nonnull not found
18-May-2018 21:04:08 warning: unknown enum constant When.MAYBE
18-May-2018 21:04:08   reason: class file for javax.annotation.meta.When not found
18-May-2018 21:04:08 2 warnings
18-May-2018 21:04:08
18-May-2018 21:04:08 > Task :spring-integration-ip:processResources
18-May-2018 21:04:08 > Task :spring-integration-ip:classes
18-May-2018 21:04:08 > Task :spring-integration-ip:checkstyleMain
18-May-2018 21:04:08 > Task :spring-integration-event:jar
18-May-2018 21:04:08 > Task :spring-integration-ip:compileTestKotlin
18-May-2018 21:04:10 > Task :spring-integration-ip:compileTestJava
18-May-2018 21:04:10 > Task :spring-integration-ip:processTestResources
18-May-2018 21:04:10 > Task :spring-integration-ip:testClasses
18-May-2018 21:04:11 > Task :spring-integration-ip:checkstyleTest
18-May-2018 21:04:13
18-May-2018 21:04:13 > Task :spring-integration-ip:javadoc
18-May-2018 21:04:13 warning: unknown enum constant When.MAYBE
18-May-2018 21:04:13   reason: class file for javax.annotation.meta.When not found
18-May-2018 21:04:15 1 warning
18-May-2018 21:04:15
18-May-2018 21:04:15 > Task :spring-integration-ip:checkTestConfigs
18-May-2018 21:04:45 > Task :spring-integration-ip:test
18-May-2018 21:05:08 > Task :spring-integration-ip:check
18-May-2018 21:05:08 > Task :spring-integration-jdbc:checkstyleMain
18-May-2018 21:05:09 Download https://repo.spring.io/libs-milestone/mysql/mysql-connector-java/8.0.11/mysql-connector-java-8.0.11.pom
18-May-2018 21:05:09 Download https://repo.spring.io/libs-milestone/com/google/protobuf/protobuf-java/2.6.0/protobuf-java-2.6.0.pom
18-May-2018 21:05:09 Download https://repo.spring.io/libs-milestone/com/google/protobuf/protobuf-java/2.6.0/protobuf-java-2.6.0.jar
18-May-2018 21:05:09 Download https://repo.spring.io/libs-milestone/mysql/mysql-connector-java/8.0.11/mysql-connector-java-8.0.11.jar
18-May-2018 21:05:10 > Task :spring-integration-jdbc:compileTestKotlin
18-May-2018 21:05:12 > Task :spring-integration-jdbc:compileTestJava
18-May-2018 21:05:12 > Task :spring-integration-jdbc:processTestResources
18-May-2018 21:05:12 > Task :spring-integration-jdbc:testClasses
18-May-2018 21:05:13 > Task :spring-integration-jdbc:checkstyleTest
18-May-2018 21:05:15 > Task :spring-integration-jdbc:javadoc
18-May-2018 21:05:15 > Task :spring-integration-jdbc:checkTestConfigs
18-May-2018 21:05:45 > Task :spring-integration-jdbc:test
18-May-2018 21:06:00 > Task :spring-integration-jdbc:check
18-May-2018 21:06:00 Download https://repo.spring.io/libs-snapshot/org/springframework/spring-jms/5.1.0.BUILD-SNAPSHOT/maven-metadata.xml
18-May-2018 21:06:01 Download https://repo.spring.io/libs-snapshot/org/springframework/spring-jms/5.1.0.BUILD-SNAPSHOT/spring-jms-5.1.0.BUILD-20180518.202419-118.pom
18-May-2018 21:06:02 Download https://repo.spring.io/libs-snapshot/org/springframework/spring-jms/5.1.0.BUILD-SNAPSHOT/spring-jms-5.1.0.BUILD-20180518.202419-118.jar
18-May-2018 21:06:02 > Task :spring-integration-jms:compileKotlin
18-May-2018 21:06:02 > Task :spring-integration-jms:compileJava
18-May-2018 21:06:02 > Task :spring-integration-jms:processResources
18-May-2018 21:06:02 > Task :spring-integration-jms:classes
18-May-2018 21:06:03 > Task :spring-integration-jms:checkstyleMain
18-May-2018 21:06:03 Download https://repo.spring.io/libs-snapshot/org/springframework/spring-oxm/5.1.0.BUILD-SNAPSHOT/maven-metadata.xml
18-May-2018 21:06:04 Download https://repo.spring.io/libs-snapshot/org/springframework/spring-oxm/5.1.0.BUILD-SNAPSHOT/spring-oxm-5.1.0.BUILD-20180518.202419-118.pom
18-May-2018 21:06:05 Download https://repo.spring.io/libs-snapshot/org/springframework/spring-oxm/5.1.0.BUILD-SNAPSHOT/spring-oxm-5.1.0.BUILD-20180518.202419-118.jar
18-May-2018 21:06:07 > Task :spring-integration-jms:compileTestKotlin
18-May-2018 21:06:08 > Task :spring-integration-jms:compileTestJava
18-May-2018 21:06:08 > Task :spring-integration-jms:processTestResources
18-May-2018 21:06:08 > Task :spring-integration-jms:testClasses
18-May-2018 21:06:09 > Task :spring-integration-jms:checkstyleTest
18-May-2018 21:06:12 > Task :spring-integration-jms:javadoc
18-May-2018 21:06:12 > Task :spring-integration-jms:checkTestConfigs
18-May-2018 21:06:42 > Task :spring-integration-jms:test
18-May-2018 21:07:33 > Task :spring-integration-jms:check
18-May-2018 21:07:33 > Task :spring-integration-jmx:compileKotlin
18-May-2018 21:07:33 > Task :spring-integration-jmx:compileJava
18-May-2018 21:07:33 > Task :spring-integration-jmx:processResources
18-May-2018 21:07:33 > Task :spring-integration-jmx:classes
18-May-2018 21:07:33 > Task :spring-integration-jmx:checkstyleMain
18-May-2018 21:07:33 Download https://repo.spring.io/libs-milestone/com/hazelcast/hazelcast/3.8/hazelcast-3.8.pom
18-May-2018 21:07:33 Download https://repo.spring.io/libs-milestone/com/hazelcast/hazelcast-root/3.8/hazelcast-root-3.8.pom
18-May-2018 21:07:34 Download https://repo.spring.io/libs-milestone/com/hazelcast/hazelcast/3.8/hazelcast-3.8.jar
18-May-2018 21:07:35 > Task :spring-integration-jmx:compileTestKotlin
18-May-2018 21:07:36 > Task :spring-integration-jmx:compileTestJava
18-May-2018 21:07:36 > Task :spring-integration-jmx:processTestResources
18-May-2018 21:07:36 > Task :spring-integration-jmx:testClasses
18-May-2018 21:07:37 > Task :spring-integration-jmx:checkstyleTest
18-May-2018 21:07:38 > Task :spring-integration-jmx:javadoc
18-May-2018 21:07:39 > Task :spring-integration-jmx:checkTestConfigs
18-May-2018 21:08:06 > Task :spring-integration-jmx:test
18-May-2018 21:08:06 > Task :spring-integration-jmx:check
18-May-2018 21:08:06 > Task :spring-integration-jpa:compileKotlin
18-May-2018 21:08:06 > Task :spring-integration-jpa:compileJava
18-May-2018 21:08:07 > Task :spring-integration-jpa:processResources
18-May-2018 21:08:07 > Task :spring-integration-jpa:classes
18-May-2018 21:08:07 > Task :spring-integration-jpa:checkstyleMain
18-May-2018 21:08:07 > Task :spring-integration-jpa:compileTestKotlin
18-May-2018 21:08:08 > Task :spring-integration-jpa:compileTestJava
18-May-2018 21:08:09 > Task :spring-integration-jpa:processTestResources
18-May-2018 21:08:09 > Task :spring-integration-jpa:testClasses
18-May-2018 21:08:09 > Task :spring-integration-jpa:checkstyleTest
18-May-2018 21:08:11 > Task :spring-integration-jpa:javadoc
18-May-2018 21:08:11 > Task :spring-integration-jpa:checkTestConfigs
18-May-2018 21:08:41 > Task :spring-integration-jpa:test
18-May-2018 21:08:43 > Task :spring-integration-jpa:check
18-May-2018 21:08:43 > Task :spring-integration-mail:compileKotlin
18-May-2018 21:08:44 > Task :spring-integration-mail:compileJava
18-May-2018 21:08:44 > Task :spring-integration-mail:processResources
18-May-2018 21:08:44 > Task :spring-integration-mail:classes
18-May-2018 21:08:44 > Task :spring-integration-mail:checkstyleMain
18-May-2018 21:08:44 > Task :spring-integration-mail:compileTestKotlin
18-May-2018 21:08:44 > Task :spring-integration-mail:compileTestJava
18-May-2018 21:08:44 > Task :spring-integration-mail:processTestResources
18-May-2018 21:08:44 > Task :spring-integration-mail:testClasses
18-May-2018 21:08:45 > Task :spring-integration-mail:checkstyleTest
18-May-2018 21:08:47 > Task :spring-integration-mail:javadoc
18-May-2018 21:08:47 > Task :spring-integration-mail:checkTestConfigs
18-May-2018 21:08:58 > Task :spring-integration-mail:test
18-May-2018 21:08:58 > Task :spring-integration-mail:check
18-May-2018 21:08:58 Download https://repo.spring.io/libs-snapshot/org/springframework/data/spring-data-mongodb/2.1.0.BUILD-SNAPSHOT/maven-metadata.xml
18-May-2018 21:08:58 Download https://repo.spring.io/libs-snapshot/org/springframework/data/spring-data-mongodb/2.1.0.BUILD-SNAPSHOT/spring-data-mongodb-2.1.0.BUILD-20180518.032558-600.pom
18-May-2018 21:08:58 Download https://repo.spring.io/libs-snapshot/org/springframework/data/spring-data-mongodb-parent/2.1.0.BUILD-SNAPSHOT/maven-metadata.xml
18-May-2018 21:08:59 Download https://repo.spring.io/libs-snapshot/org/springframework/data/spring-data-mongodb-parent/2.1.0.BUILD-SNAPSHOT/spring-data-mongodb-parent-2.1.0.BUILD-20180518.032558-600.pom
18-May-2018 21:08:59 Download https://repo.spring.io/libs-snapshot/org/springframework/data/spring-data-mongodb/2.1.0.BUILD-SNAPSHOT/spring-data-mongodb-2.1.0.BUILD-20180518.032558-600.jar
18-May-2018 21:09:00 > Task :spring-integration-mongodb:compileKotlin
18-May-2018 21:09:00 > Task :spring-integration-mongodb:compileJava
18-May-2018 21:09:00 > Task :spring-integration-mongodb:processResources
18-May-2018 21:09:00 > Task :spring-integration-mongodb:classes
18-May-2018 21:09:00 > Task :spring-integration-mongodb:checkstyleMain
18-May-2018 21:09:00 > Task :spring-integration-mongodb:compileTestKotlin
18-May-2018 21:09:01 > Task :spring-integration-mongodb:compileTestJava
18-May-2018 21:09:01 > Task :spring-integration-mongodb:processTestResources
18-May-2018 21:09:01 > Task :spring-integration-mongodb:testClasses
18-May-2018 21:09:01 > Task :spring-integration-mongodb:checkstyleTest
18-May-2018 21:09:03 > Task :spring-integration-mongodb:javadoc
18-May-2018 21:09:03 > Task :spring-integration-mongodb:checkTestConfigs
18-May-2018 21:09:30 > Task :spring-integration-mongodb:test
18-May-2018 21:09:30 > Task :spring-integration-mongodb:check
18-May-2018 21:09:31 > Task :spring-integration-mqtt:compileKotlin
18-May-2018 21:09:31 > Task :spring-integration-mqtt:compileJava
18-May-2018 21:09:31 > Task :spring-integration-mqtt:processResources
18-May-2018 21:09:31 > Task :spring-integration-mqtt:classes
18-May-2018 21:09:31 > Task :spring-integration-mqtt:checkstyleMain
18-May-2018 21:09:31 > Task :spring-integration-mqtt:compileTestKotlin
18-May-2018 21:09:32 > Task :spring-integration-mqtt:compileTestJava
18-May-2018 21:09:32 > Task :spring-integration-mqtt:processTestResources
18-May-2018 21:09:32 > Task :spring-integration-mqtt:testClasses
18-May-2018 21:09:32 > Task :spring-integration-mqtt:checkstyleTest
18-May-2018 21:09:34 > Task :spring-integration-mqtt:javadoc
18-May-2018 21:09:34 > Task :spring-integration-mqtt:checkTestConfigs
18-May-2018 21:10:04 > Task :spring-integration-mqtt:test
18-May-2018 21:10:11 > Task :spring-integration-mqtt:check
18-May-2018 21:10:11 > Task :spring-integration-redis:checkstyleMain
18-May-2018 21:10:12 > Task :spring-integration-redis:checkstyleTest
18-May-2018 21:10:14 > Task :spring-integration-redis:javadoc
18-May-2018 21:10:14 > Task :spring-integration-redis:checkTestConfigs
18-May-2018 21:10:44 > Task :spring-integration-redis:test
18-May-2018 21:11:06 > Task :spring-integration-redis:check
18-May-2018 21:11:06 > Task :spring-integration-rmi:compileKotlin
18-May-2018 21:11:06 > Task :spring-integration-rmi:compileJava
18-May-2018 21:11:06 > Task :spring-integration-rmi:processResources
18-May-2018 21:11:06 > Task :spring-integration-rmi:classes
18-May-2018 21:11:06 > Task :spring-integration-rmi:checkstyleMain
18-May-2018 21:11:06 > Task :spring-integration-rmi:compileTestKotlin
18-May-2018 21:11:06 > Task :spring-integration-rmi:compileTestJava
18-May-2018 21:11:06 > Task :spring-integration-rmi:processTestResources
18-May-2018 21:11:06 > Task :spring-integration-rmi:testClasses
18-May-2018 21:11:07 > Task :spring-integration-rmi:checkstyleTest
18-May-2018 21:11:08 > Task :spring-integration-rmi:javadoc
18-May-2018 21:11:08 > Task :spring-integration-rmi:checkTestConfigs
18-May-2018 21:11:15 > Task :spring-integration-rmi:test
18-May-2018 21:11:15 > Task :spring-integration-rmi:check
18-May-2018 21:11:15 > Task :spring-integration-scripting:checkstyleMain
18-May-2018 21:11:15 Download https://repo.spring.io/libs-milestone/org/python/jython-standalone/2.5.3/jython-standalone-2.5.3.pom
18-May-2018 21:11:16 Download https://repo.spring.io/libs-milestone/org/python/jython-standalone/2.5.3/jython-standalone-2.5.3.jar
18-May-2018 21:11:19 > Task :spring-integration-scripting:compileTestKotlin
18-May-2018 21:11:22 > Task :spring-integration-scripting:compileTestJava
18-May-2018 21:11:22 > Task :spring-integration-scripting:processTestResources
18-May-2018 21:11:22 > Task :spring-integration-scripting:testClasses
18-May-2018 21:11:22 > Task :spring-integration-scripting:checkstyleTest
18-May-2018 21:11:22 > Task :spring-integration-scripting:checkTestConfigs
18-May-2018 21:11:52 > Task :spring-integration-scripting:test
18-May-2018 21:11:55 > Task :spring-integration-scripting:check
18-May-2018 21:11:55 > Task :spring-integration-security:checkstyleMain
18-May-2018 21:11:55 > Task :spring-integration-security:compileTestKotlin
18-May-2018 21:11:56 > Task :spring-integration-security:compileTestJava
18-May-2018 21:11:56 > Task :spring-integration-security:processTestResources
18-May-2018 21:11:56 > Task :spring-integration-security:testClasses
18-May-2018 21:11:56 > Task :spring-integration-security:checkstyleTest
18-May-2018 21:11:57 > Task :spring-integration-security:javadoc
18-May-2018 21:11:57 > Task :spring-integration-security:checkTestConfigs
18-May-2018 21:12:07 > Task :spring-integration-security:test
18-May-2018 21:12:07 > Task :spring-integration-security:check
18-May-2018 21:12:08 > Task :spring-integration-sftp:compileKotlin
18-May-2018 21:12:08 > Task :spring-integration-sftp:compileJava
18-May-2018 21:12:08 > Task :spring-integration-sftp:processResources
18-May-2018 21:12:08 > Task :spring-integration-sftp:classes
18-May-2018 21:12:08 > Task :spring-integration-sftp:checkstyleMain
18-May-2018 21:12:08 Download https://repo.spring.io/libs-milestone/org/apache/sshd/sshd-core/1.7.0/sshd-core-1.7.0.pom
18-May-2018 21:12:08 Download https://repo.spring.io/libs-milestone/org/apache/sshd/sshd/1.7.0/sshd-1.7.0.pom
18-May-2018 21:12:08 Download https://repo.spring.io/libs-milestone/org/springframework/spring-framework-bom/5.0.2.RELEASE/spring-framework-bom-5.0.2.RELEASE.pom
18-May-2018 21:12:09 Download https://repo.spring.io/libs-milestone/org/apache/sshd/sshd-core/1.7.0/sshd-core-1.7.0.jar
18-May-2018 21:12:09 > Task :spring-integration-sftp:compileTestKotlin
18-May-2018 21:12:10 > Task :spring-integration-sftp:compileTestJava
18-May-2018 21:12:10 > Task :spring-integration-sftp:processTestResources
18-May-2018 21:12:10 > Task :spring-integration-sftp:testClasses
18-May-2018 21:12:10 > Task :spring-integration-sftp:checkstyleTest
18-May-2018 21:12:12 > Task :spring-integration-stream:javadoc
18-May-2018 21:12:14 > Task :spring-integration-sftp:javadoc
18-May-2018 21:12:14 > Task :spring-integration-sftp:checkTestConfigs
18-May-2018 21:12:42 > Task :spring-integration-sftp:test
18-May-2018 21:12:42 > Task :spring-integration-sftp:check
18-May-2018 21:12:43 Download https://repo.spring.io/libs-snapshot/org/springframework/spring-websocket/5.1.0.BUILD-SNAPSHOT/maven-metadata.xml
18-May-2018 21:12:43 Download https://repo.spring.io/libs-snapshot/io/projectreactor/ipc/reactor-netty/0.7.8.BUILD-SNAPSHOT/maven-metadata.xml
18-May-2018 21:12:43 Download https://repo.spring.io/libs-snapshot/org/springframework/spring-websocket/5.1.0.BUILD-SNAPSHOT/spring-websocket-5.1.0.BUILD-20180518.202419-118.pom
18-May-2018 21:12:43 Download https://repo.spring.io/libs-snapshot/io/projectreactor/ipc/reactor-netty/0.7.8.BUILD-SNAPSHOT/reactor-netty-0.7.8.BUILD-20180514.193224-14.pom
18-May-2018 21:12:44 Download https://repo.spring.io/libs-snapshot/io/projectreactor/ipc/reactor-netty/0.7.8.BUILD-SNAPSHOT/reactor-netty-0.7.8.BUILD-20180514.193224-14.jar
18-May-2018 21:12:44 Download https://repo.spring.io/libs-snapshot/org/springframework/spring-websocket/5.1.0.BUILD-SNAPSHOT/spring-websocket-5.1.0.BUILD-20180518.202419-118.jar
18-May-2018 21:12:44 > Task :spring-integration-stomp:compileKotlin
18-May-2018 21:12:45 > Task :spring-integration-stomp:compileJava
18-May-2018 21:12:45 > Task :spring-integration-stomp:processResources
18-May-2018 21:12:45 > Task :spring-integration-stomp:classes
18-May-2018 21:12:45 > Task :spring-integration-stomp:checkstyleMain
18-May-2018 21:12:45 > Task :spring-integration-websocket:compileKotlin
18-May-2018 21:12:45 > Task :spring-integration-websocket:compileJava
18-May-2018 21:12:45 > Task :spring-integration-websocket:processResources
18-May-2018 21:12:45 > Task :spring-integration-websocket:classes
18-May-2018 21:12:45 Download https://repo.spring.io/libs-milestone/org/apache/tomcat/embed/tomcat-embed-websocket/9.0.7/tomcat-embed-websocket-9.0.7.pom
18-May-2018 21:12:45 Download https://repo.spring.io/libs-milestone/org/apache/tomcat/embed/tomcat-embed-core/9.0.7/tomcat-embed-core-9.0.7.pom
18-May-2018 21:12:45 Download https://repo.spring.io/libs-milestone/org/apache/tomcat/tomcat-annotations-api/9.0.7/tomcat-annotations-api-9.0.7.pom
18-May-2018 21:12:45 Download https://repo.spring.io/libs-milestone/org/apache/tomcat/embed/tomcat-embed-websocket/9.0.7/tomcat-embed-websocket-9.0.7.jar
18-May-2018 21:12:45 Download https://repo.spring.io/libs-milestone/org/apache/tomcat/tomcat-annotations-api/9.0.7/tomcat-annotations-api-9.0.7.jar
18-May-2018 21:12:45 Download https://repo.spring.io/libs-milestone/org/apache/tomcat/embed/tomcat-embed-core/9.0.7/tomcat-embed-core-9.0.7.jar
18-May-2018 21:12:46 > Task :spring-integration-websocket:compileTestKotlin
18-May-2018 21:12:46 > Task :spring-integration-websocket:jar
18-May-2018 21:12:47 > Task :spring-integration-websocket:compileTestJava
18-May-2018 21:12:47 > Task :spring-integration-websocket:processTestResources
18-May-2018 21:12:47 > Task :spring-integration-websocket:testClasses
18-May-2018 21:12:47 > Task :spring-integration-stomp:compileTestKotlin
18-May-2018 21:12:47 > Task :spring-integration-stomp:compileTestJava
18-May-2018 21:12:47 > Task :spring-integration-stomp:processTestResources
18-May-2018 21:12:47 > Task :spring-integration-stomp:testClasses
18-May-2018 21:12:48 > Task :spring-integration-stomp:checkstyleTest
18-May-2018 21:12:49 > Task :spring-integration-stomp:javadoc
18-May-2018 21:12:49 > Task :spring-integration-stomp:checkTestConfigs
18-May-2018 21:13:04 > Task :spring-integration-stomp:test
18-May-2018 21:13:04 > Task :spring-integration-stomp:check
18-May-2018 21:13:04 > Task :spring-integration-stream:checkstyleMain
18-May-2018 21:13:04 > Task :spring-integration-stream:compileTestKotlin
18-May-2018 21:13:04 > Task :spring-integration-stream:compileTestJava
18-May-2018 21:13:04 > Task :spring-integration-stream:processTestResources
18-May-2018 21:13:04 > Task :spring-integration-stream:testClasses
18-May-2018 21:13:05 > Task :spring-integration-stream:checkstyleTest
18-May-2018 21:13:05 > Task :spring-integration-stream:checkTestConfigs
18-May-2018 21:13:11 > Task :spring-integration-stream:test
18-May-2018 21:13:11 > Task :spring-integration-stream:check
18-May-2018 21:13:11 > Task :spring-integration-ip:jar
18-May-2018 21:13:11 > Task :spring-integration-syslog:compileKotlin
18-May-2018 21:13:11 > Task :spring-integration-syslog:compileJava
18-May-2018 21:13:11 > Task :spring-integration-syslog:processResources
18-May-2018 21:13:11 > Task :spring-integration-syslog:classes
18-May-2018 21:13:12 > Task :spring-integration-syslog:checkstyleMain
18-May-2018 21:13:12 > Task :spring-integration-syslog:compileTestKotlin
18-May-2018 21:13:12 > Task :spring-integration-syslog:compileTestJava
18-May-2018 21:13:12 > Task :spring-integration-syslog:processTestResources
18-May-2018 21:13:12 > Task :spring-integration-syslog:testClasses
18-May-2018 21:13:12 > Task :spring-integration-syslog:checkstyleTest
18-May-2018 21:13:13 > Task :spring-integration-syslog:javadoc
18-May-2018 21:13:13 > Task :spring-integration-syslog:checkTestConfigs
18-May-2018 21:13:26 > Task :spring-integration-syslog:test
18-May-2018 21:13:26 > Task :spring-integration-syslog:check
18-May-2018 21:13:26 > Task :spring-integration-test:compileKotlin
18-May-2018 21:13:27 > Task :spring-integration-test:compileJava
18-May-2018 21:13:27 > Task :spring-integration-test:processResources
18-May-2018 21:13:27 > Task :spring-integration-test:classes
18-May-2018 21:13:27 > Task :spring-integration-test:checkstyleMain
18-May-2018 21:13:27 > Task :spring-integration-test:compileTestKotlin
18-May-2018 21:13:27 > Task :spring-integration-test:compileTestJava
18-May-2018 21:13:27 > Task :spring-integration-test:processTestResources
18-May-2018 21:13:27 > Task :spring-integration-test:testClasses
18-May-2018 21:13:27 > Task :spring-integration-test:checkstyleTest
18-May-2018 21:13:29 > Task :spring-integration-test-support:javadoc
18-May-2018 21:13:30 > Task :spring-integration-test:javadoc
18-May-2018 21:13:30 > Task :spring-integration-test:checkTestConfigs
18-May-2018 21:13:38 > Task :spring-integration-test:test
18-May-2018 21:13:38 > Task :spring-integration-test:check
18-May-2018 21:13:38 > Task :spring-integration-test-support:checkstyleMain
18-May-2018 21:13:38 > Task :spring-integration-test-support:compileTestKotlin
18-May-2018 21:13:38 > Task :spring-integration-test-support:compileTestJava
18-May-2018 21:13:38 > Task :spring-integration-test-support:processTestResources
18-May-2018 21:13:38 > Task :spring-integration-test-support:testClasses
18-May-2018 21:13:39 > Task :spring-integration-test-support:checkstyleTest
18-May-2018 21:13:39 > Task :spring-integration-test-support:checkTestConfigs
18-May-2018 21:13:42 > Task :spring-integration-test-support:test
18-May-2018 21:13:42 > Task :spring-integration-test-support:check
18-May-2018 21:13:42 Download https://repo.spring.io/libs-milestone/com/fasterxml/jackson/core/jackson-core/2.6.1/jackson-core-2.6.1.pom
18-May-2018 21:13:42 Download https://repo.spring.io/libs-milestone/org/springframework/security/spring-security-crypto/3.2.8.RELEASE/spring-security-crypto-3.2.8.RELEASE.pom
18-May-2018 21:13:42 Download https://repo.spring.io/libs-milestone/org/springframework/social/spring-social-core/1.1.0.RELEASE/spring-social-core-1.1.0.RELEASE.pom
18-May-2018 21:13:42 Download https://repo.spring.io/libs-milestone/org/springframework/social/spring-social-config/1.1.0.RELEASE/spring-social-config-1.1.0.RELEASE.pom
18-May-2018 21:13:42 Download https://repo.spring.io/libs-milestone/com/fasterxml/jackson/core/jackson-annotations/2.6.1/jackson-annotations-2.6.1.pom
18-May-2018 21:13:42 Download https://repo.spring.io/libs-milestone/org/springframework/social/spring-social-web/1.1.0.RELEASE/spring-social-web-1.1.0.RELEASE.pom
18-May-2018 21:13:43 Download https://repo.spring.io/libs-milestone/org/springframework/social/spring-social-web/1.1.0.RELEASE/spring-social-web-1.1.0.RELEASE.jar
18-May-2018 21:13:43 Download https://repo.spring.io/libs-milestone/org/springframework/security/spring-security-crypto/3.2.8.RELEASE/spring-security-crypto-3.2.8.RELEASE.jar
18-May-2018 21:13:43 Download https://repo.spring.io/libs-milestone/org/springframework/social/spring-social-config/1.1.0.RELEASE/spring-social-config-1.1.0.RELEASE.jar
18-May-2018 21:13:43 Download https://repo.spring.io/libs-milestone/org/springframework/social/spring-social-core/1.1.0.RELEASE/spring-social-core-1.1.0.RELEASE.jar
18-May-2018 21:13:43 > Task :spring-integration-twitter:compileKotlin
18-May-2018 21:13:43 > Task :spring-integration-twitter:compileJava
18-May-2018 21:13:43 > Task :spring-integration-twitter:processResources
18-May-2018 21:13:43 > Task :spring-integration-twitter:classes
18-May-2018 21:13:43 > Task :spring-integration-twitter:checkstyleMain
18-May-2018 21:13:43 > Task :spring-integration-twitter:compileTestKotlin
18-May-2018 21:13:44 > Task :spring-integration-twitter:compileTestJava
18-May-2018 21:13:44 > Task :spring-integration-twitter:processTestResources
18-May-2018 21:13:44 > Task :spring-integration-twitter:testClasses
18-May-2018 21:13:44 > Task :spring-integration-twitter:checkstyleTest
18-May-2018 21:13:45 > Task :spring-integration-twitter:javadoc
18-May-2018 21:13:45 > Task :spring-integration-twitter:checkTestConfigs
18-May-2018 21:13:56 > Task :spring-integration-twitter:test
18-May-2018 21:13:56 > Task :spring-integration-twitter:check
18-May-2018 21:13:56 > Task :spring-integration-http:jar
18-May-2018 21:13:57 Download https://repo.spring.io/libs-snapshot/org/springframework/spring-webflux/5.1.0.BUILD-SNAPSHOT/maven-metadata.xml
18-May-2018 21:13:57 Download https://repo.spring.io/libs-snapshot/org/springframework/spring-webflux/5.1.0.BUILD-SNAPSHOT/spring-webflux-5.1.0.BUILD-20180518.202419-118.pom
18-May-2018 21:13:57 Download https://repo.spring.io/libs-snapshot/org/springframework/spring-webflux/5.1.0.BUILD-SNAPSHOT/spring-webflux-5.1.0.BUILD-20180518.202419-118.jar
18-May-2018 21:13:57 > Task :spring-integration-webflux:compileKotlin
18-May-2018 21:13:58 > Task :spring-integration-webflux:compileJava
18-May-2018 21:13:58 > Task :spring-integration-webflux:processResources
18-May-2018 21:13:58 > Task :spring-integration-webflux:classes
18-May-2018 21:13:58 > Task :spring-integration-webflux:checkstyleMain
18-May-2018 21:13:58 > Task :spring-integration-webflux:compileTestKotlin
18-May-2018 21:13:58 > Task :spring-integration-webflux:compileTestJava
18-May-2018 21:13:58 > Task :spring-integration-webflux:processTestResources
18-May-2018 21:13:58 > Task :spring-integration-webflux:testClasses
18-May-2018 21:13:58 > Task :spring-integration-webflux:checkstyleTest
18-May-2018 21:14:00 > Task :spring-integration-webflux:javadoc
18-May-2018 21:14:00 > Task :spring-integration-webflux:checkTestConfigs
18-May-2018 21:14:10
18-May-2018 21:14:10 > Task :spring-integration-webflux:test
18-May-2018 21:14:10
18-May-2018 21:14:10 org.springframework.integration.webflux.dsl.WebFluxDslTests > testSse FAILED
18-May-2018 21:14:10     org.springframework.beans.factory.BeanCreationException
18-May-2018 21:14:10         Caused by: org.springframework.beans.factory.NoSuchBeanDefinitionException
18-May-2018 21:14:10
18-May-2018 21:14:10 org.springframework.integration.webflux.dsl.WebFluxDslTests > testWebFluxFlowWithReplyPayloadToFlux FAILED
18-May-2018 21:14:10     org.springframework.beans.factory.BeanCreationException
18-May-2018 21:14:10         Caused by: org.springframework.beans.factory.NoSuchBeanDefinitionException
18-May-2018 21:14:10
18-May-2018 21:14:10 org.springframework.integration.webflux.dsl.WebFluxDslTests > testHttpReactiveProxyFlow FAILED
18-May-2018 21:14:10     org.springframework.beans.factory.BeanCreationException
18-May-2018 21:14:10         Caused by: org.springframework.beans.factory.NoSuchBeanDefinitionException
18-May-2018 21:14:10
18-May-2018 21:14:10 org.springframework.integration.webflux.dsl.WebFluxDslTests > testHttpReactivePost FAILED
18-May-2018 21:14:10     org.springframework.beans.factory.BeanCreationException
18-May-2018 21:14:10         Caused by: org.springframework.beans.factory.NoSuchBeanDefinitionException
18-May-2018 21:14:11
18-May-2018 21:14:11 23 tests completed, 4 failed
18-May-2018 21:14:11
18-May-2018 21:14:11 > Task :spring-integration-webflux:test FAILED
18-May-2018 21:14:11
18-May-2018 21:14:11 Deprecated Gradle features were used in this build, making it incompatible with Gradle 5.0.
18-May-2018 21:14:11 See https://docs.gradle.org/4.7/userguide/command_line_interface.html#sec:command_line_warnings
18-May-2018 21:14:11
18-May-2018 21:14:11 BUILD FAILED in 17m 16s
18-May-2018 21:14:11 374 actionable tasks: 339 executed, 35 up-to-date
18-May-2018 21:14:11
18-May-2018 21:14:11 FAILURE: Build failed with an exception.
18-May-2018 21:14:11
18-May-2018 21:14:11 * What went wrong:
18-May-2018 21:14:11 Execution failed for task ':spring-integration-webflux:test'.
18-May-2018 21:14:11 > There were failing tests. See the report at: file:///opt/bamboo-home/xml-data/build-dir/INT-BSP32-JOB1/spring-integration-webflux/build/reports/tests/test/index.html
18-May-2018 21:14:11
18-May-2018 21:14:11 * Try:
18-May-2018 21:14:11 Run with --stacktrace option to get the stack trace. Run with --info or --debug option to get more log output. Run with --scan to get full insights.
18-May-2018 21:14:11
18-May-2018 21:14:11 * Get more help at https://help.gradle.org
18-May-2018 21:14:11
18-May-2018 21:14:11 Failing task since return code of [./gradlew --no-daemon clean check] was 1 while expected 0
18-May-2018 21:14:11 Parsing test results under /opt/bamboo-home/xml-data/build-dir/INT-BSP32-JOB1...
18-May-2018 21:14:12 Finished task 'Artifactory Gradle' with result: Failed
18-May-2018 21:14:12 Running post build plugin 'Docker Container Cleanup'
18-May-2018 21:14:12 Running post build plugin 'NCover Results Collector'
18-May-2018 21:14:12 Running post build plugin 'Artifactory Release Management Staging'
18-May-2018 21:14:12 Running post build plugin 'Artifactory Build Info Copier'
18-May-2018 21:14:12 Running post build plugin 'Artifactory Gradle Properties Info Copier'
18-May-2018 21:14:12 Running post build plugin 'Clover Results Collector'
18-May-2018 21:14:12 Running post build plugin 'npm Cache Cleanup'
18-May-2018 21:14:12 Running post build plugin 'Artifact Copier'
18-May-2018 21:14:12 Publishing an artifact: Test Results
18-May-2018 21:14:13 Finished publishing of artifact Job artifact: [Test Results], pattern: [*/build/reports/tests/**/*.*] in 794.0 ms
18-May-2018 21:14:14 Successfully removed working directory at '/opt/bamboo-home/xml-data/build-dir/INT-BSP32-JOB1'
18-May-2018 21:14:14 Finalising the build...
18-May-2018 21:14:14 Stopping timer.
18-May-2018 21:14:14 Build INT-BSP32-JOB1-46 completed.
18-May-2018 21:14:14 Running on server: post build plugin 'NCover Results Collector'
18-May-2018 21:14:14 Running on server: post build plugin 'Build Hanging Detection Configuration'
18-May-2018 21:14:14 Running on server: post build plugin 'Clover Delta Calculator'
18-May-2018 21:14:14 Running on server: post build plugin 'Maven Dependencies Postprocessor'
18-May-2018 21:14:14 All post build plugins have finished
18-May-2018 21:14:14 Generating build results summary...
18-May-2018 21:14:17 Saving build results to disk...
18-May-2018 21:14:17 Logging substituted variables...
18-May-2018 21:14:17 Indexing build results...
18-May-2018 21:14:17 Finished building INT-BSP32-JOB1-46.