Plan for building against test branches

Build: #48 failed

Job: Default Job failed

Stages & jobs

  1. Default Stage

Job result summary

Completed
Duration
1 minute
Revision
7edc55f5bf0fce164dabc26f005cc8cb2d008100 7edc55f5bf0fce164dabc26f005cc8cb2d008100
Total tests
134
Failing since
#46 (Manual run by Artem Bilan)
Fixed in
#50 (Manual run by Artem Bilan)

Tests

  • 134 tests in total
  • 1 test failed
  • 1 failure is new
  • 3 tests were quarantined / skipped
  • 8 seconds taken in total.
New test failures 1
Status Test Duration
Collapse Failed MessageSourceTests testMaxFetch History
< 1 sec
java.lang.IllegalStateException: java.lang.IllegalStateException: Failed to load ApplicationContext
java.lang.IllegalStateException: Failed to load ApplicationContext
	at org.springframework.test.context.cache.DefaultCacheAwareContextLoaderDelegate.loadContext(DefaultCacheAwareContextLoaderDelegate.java:125)
	at org.springframework.test.context.support.DefaultTestContext.getApplicationContext(DefaultTestContext.java:108)
	at org.springframework.test.context.support.DependencyInjectionTestExecutionListener.injectDependencies(DependencyInjectionTestExecutionListener.java:118)
	at org.springframework.test.context.support.DependencyInjectionTestExecutionListener.prepareTestInstance(DependencyInjectionTestExecutionListener.java:83)
	at org.springframework.test.context.TestContextManager.prepareTestInstance(TestContextManager.java:246)
	at org.springframework.test.context.junit4.SpringJUnit4ClassRunner.createTest(SpringJUnit4ClassRunner.java:227)
(90 more lines...)

Error summary

The build generated some errors. See the full build log for more details.


134 tests completed, 1 failed, 3 skipped

FAILURE: Build failed with an exception.

* What went wrong:
Execution failed for task ':spring-integration-jmx:testAll'.
> There were failing tests. See the report at: file:///opt/bamboo-home/xml-data/build-dir/INT-BSP32-JOB1/spring-integration-jmx/build/reports/tests/testAll/index.html

* Try:
Run with --stacktrace option to get the stack trace. Run with --info or --debug option to get more log output. Run with --scan to get full insights.

* Get more help at https://help.gradle.org

BUILD FAILED in 1m 15s