Disabled until Spring Framework (Stomp) Upgrades to Reactor 3

Build: #1012 failed Scheduled

Build result summary

Details

Completed
Duration
19 minutes
Labels
None
Agent
bamboo-23.af.pivotal.io
Revision
0cbea82946dee0692d3389a8dcd0174e9ca8bfeb 0cbea82946dee0692d3389a8dcd0174e9ca8bfeb
Total tests
5143
Failing since
#1011 (Scheduled – )
Fixed in
#1013 (Scheduled)

Responsible

This build has been failing since #1011
No one has taken responsibility

Tests

New test failures 1
Status Test View job Duration
Collapse Failed TcpNioConnectionReadTests testReadStxEtxOverflow History
Default Job 10 secs
java.lang.AssertionError: java.lang.AssertionError
java.lang.AssertionError
	at org.junit.Assert.fail(Assert.java:86)
	at org.junit.Assert.assertTrue(Assert.java:41)
	at org.junit.Assert.assertTrue(Assert.java:52)
	at org.springframework.integration.ip.tcp.connection.TcpNioConnectionReadTests.testReadStxEtxOverflow(TcpNioConnectionReadTests.java:285)
	at sun.reflect.NativeMethodAccessorImpl.invoke0(Native Method)
	at sun.reflect.NativeMethodAccessorImpl.invoke(NativeMethodAccessorImpl.java:62)
(45 more lines...)
Fixed tests 1
Status Test Failing since View job Duration
Successful JdbcLockRegistryLeaderInitiatorTests testLostConnection History
Failing since build #1011 (Scheduled) Default Job < 1 sec