Disabled until Spring Framework (Stomp) Upgrades to Reactor 3

Build: #897 failed Scheduled

Build result summary

Details

Completed
Duration
19 minutes
Labels
None
Agent
bamboo-17.af.pivotal.io
Revision
8a4e73309cc55a70d6388101a5f964e827478dca 8a4e73309cc55a70d6388101a5f964e827478dca
Total tests
5142
Fixed in
#898 (Scheduled)

Tests

Responsible

No one has taken responsibility for this failure

Tests

New test failures 1
Status Test View job Duration
Collapse Failed JdbcLockRegistryLeaderInitiatorTests testLostConnection History
Default Job 10 secs
java.lang.AssertionError: java.lang.AssertionError: 
Expected: is <true>
     but: was <false>
java.lang.AssertionError: 
Expected: is <true>
     but: was <false>
	at org.hamcrest.MatcherAssert.assertThat(MatcherAssert.java:20)
	at org.junit.Assert.assertThat(Assert.java:956)
(49 more lines...)