Disabled until Spring Framework (Stomp) Upgrades to Reactor 3

Build: #922 failed Scheduled

Build result summary

Details

Completed
Duration
19 minutes
Labels
None
Agent
bamboo-15.af.pivotal.io
Revision
eb31825bad513dc02f15dfbb0226a238f738f59d eb31825bad513dc02f15dfbb0226a238f738f59d
Total tests
5143
Fixed in
#923 (Scheduled)

Tests

Responsible

No one has taken responsibility for this failure

Tests

New test failures 1
Status Test View job Duration
Collapse Failed RedisQueueMessageDrivenEndpointTests testInt3014ExpectMessageTrue History
Default Job < 1 sec
java.lang.AssertionError: java.lang.AssertionError: expected:<GenericMessage [payload=testing, headers={id=64e6335d-de8a-cee9-4ea0-d93f1260c94b, timestamp=1561867271336}]> but was:<GenericMessage [payload=testing, headers={id=54196e05-8c58-af50-2faf-db47462ff37e, timestamp=1561856352064}]>
java.lang.AssertionError: expected:<GenericMessage [payload=testing, headers={id=64e6335d-de8a-cee9-4ea0-d93f1260c94b, timestamp=1561867271336}]> but was:<GenericMessage [payload=testing, headers={id=54196e05-8c58-af50-2faf-db47462ff37e, timestamp=1561856352064}]>
	at org.junit.Assert.fail(Assert.java:88)
	at org.junit.Assert.failNotEquals(Assert.java:834)
	at org.junit.Assert.assertEquals(Assert.java:118)
	at org.junit.Assert.assertEquals(Assert.java:144)
	at org.springframework.integration.redis.inbound.RedisQueueMessageDrivenEndpointTests.testInt3014ExpectMessageTrue(RedisQueueMessageDrivenEndpointTests.java:178)
	at sun.reflect.NativeMethodAccessorImpl.invoke0(Native Method)
(56 more lines...)