Disabled until Spring Framework (Stomp) Upgrades to Reactor 3

Build: #938 failed Scheduled

Build result summary

Details

Completed
Duration
51 minutes
Labels
None
Agent
bamboo-20.af.pivotal.io
Revision
eff39e5cb528fd7a38a319cddebdea8715af2860 eff39e5cb528fd7a38a319cddebdea8715af2860
Total tests
3893
Fixed in
#939 (Scheduled)
No failed tests found, a possible compilation error occurred.

Tests

Responsible

No one has taken responsibility for this failure

Comments on Default Job

  1. Anonymous user

    Detected hung build state. Attempting to generate stack trace and terminate spawned sub-processes.

Error summary for Default Job

The job generated some errors, drill down into the full build log for more details.

POM relocation to an other version number is not fully supported in Gradle : xml-apis:xml-apis:2.0.2 relocated to xml-apis:xml-apis:1.0.b2.
/opt/users/bamboo/.gradle/caches/modules-2/files-2.1/org.springframework/spring-core/5.0.13.BUILD-SNAPSHOT/ea04a8e2d654f7cbeeae9bf11d5d5a08764c5ccb/spring-core-5.0.13.BUILD-SNAPSHOT.jar(org/springframework/lang/Nullable.class): warning: Cannot find annotation method 'when()' in type 'Nonnull': class file for javax.annotation.Nonnull not found
warning: unknown enum constant When.MAYBE
  reason: class file for javax.annotation.meta.When not found
2 warnings
/opt/users/bamboo/.gradle/caches/modules-2/files-2.1/org.springframework/spring-core/5.0.13.RELEASE/5a306ec429a43ce126dae5df85927bc91e395894/spring-core-5.0.13.RELEASE.jar(org/springframework/lang/Nullable.class): warning: Cannot find annotation method 'when()' in type 'Nonnull': class file for javax.annotation.Nonnull not found
warning: unknown enum constant When.MAYBE
  reason: class file for javax.annotation.meta.When not found
2 warnings
warning: unknown enum constant When.MAYBE
  reason: class file for javax.annotation.meta.When not found
warning: unknown enum constant When.MAYBE
  reason: class file for javax.annotation.meta.When not found
warning: unknown enum constant When.MAYBE
  reason: class file for javax.annotation.meta.When not found
3 warnings
*** java.lang.instrument ASSERTION FAILED ***: "!errorOutstanding" with message transform method call failed at JPLISAgent.c line: 844
*** java.lang.instrument ASSERTION FAILED ***: "!errorOutstanding" with message transform method call failed at JPLISAgent.c line: 844
*** java.lang.instrument ASSERTION FAILED ***: "!errorOutstanding" with message transform method call failed at JPLISAgent.c line: 844
/opt/users/bamboo/.gradle/caches/modules-2/files-2.1/org.springframework/spring-core/5.0.13.BUILD-SNAPSHOT/ea04a8e2d654f7cbeeae9bf11d5d5a08764c5ccb/spring-core-5.0.13.BUILD-SNAPSHOT.jar(org/springframework/lang/Nullable.class): warning: Cannot find annotation method 'when()' in type 'Nonnull': class file for javax.annotation.Nonnull not found
warning: unknown enum constant When.MAYBE
  reason: class file for javax.annotation.meta.When not found
2 warnings
/opt/users/bamboo/.gradle/caches/modules-2/files-2.1/org.springframework/spring-core/5.0.13.BUILD-SNAPSHOT/ea04a8e2d654f7cbeeae9bf11d5d5a08764c5ccb/spring-core-5.0.13.BUILD-SNAPSHOT.jar(org/springframework/lang/Nullable.class): warning: Cannot find annotation method 'when()' in type 'Nonnull': class file for javax.annotation.Nonnull not found
warning: unknown enum constant When.MAYBE
  reason: class file for javax.annotation.meta.When not found
2 warnings
Force Stop build feature is enabled for current plan. Either Bamboo has detected the build has hung or it has been manually stopped.