Disabled until Spring Framework (Stomp) Upgrades to Reactor 3

Build: #963 failed Scheduled

Build result summary

Details

Completed
Duration
19 minutes
Labels
None
Agent
bamboo-22.af.pivotal.io
Revision
853088d9b6ac6a21e9a61fc8fe95644ff990962d 853088d9b6ac6a21e9a61fc8fe95644ff990962d
Total tests
5143
Fixed in
#965 (Scheduled)

Tests

Responsible

No one has taken responsibility for this failure

Tests

New test failures 1
Status Test View job Duration
Collapse Failed JdbcLockRegistryLeaderInitiatorTests testLostConnection History
Default Job 10 secs
java.lang.AssertionError: java.lang.AssertionError: 
Expected: is <true>
     but: was <false>
java.lang.AssertionError: 
Expected: is <true>
     but: was <false>
	at org.hamcrest.MatcherAssert.assertThat(MatcherAssert.java:20)
	at org.junit.Assert.assertThat(Assert.java:956)
(49 more lines...)