Disabled until Spring Framework (Stomp) Upgrades to Reactor 3

Build: #969 failed Scheduled

Build result summary

Details

Completed
Duration
18 minutes
Labels
None
Agent
bamboo-20.af.pivotal.io
Revision
853088d9b6ac6a21e9a61fc8fe95644ff990962d 853088d9b6ac6a21e9a61fc8fe95644ff990962d
Total tests
5143
Fixed in
#970 (Scheduled)

Tests

Responsible

No one has taken responsibility for this failure

Tests

New test failures 1
Status Test View job Duration
Collapse Failed TcpNioConnectionReadTests testReadStxEtxOverflow History
Default Job 10 secs
java.lang.AssertionError: java.lang.AssertionError: Failed to close socket
java.lang.AssertionError: Failed to close socket
	at org.junit.Assert.fail(Assert.java:88)
	at org.springframework.integration.ip.tcp.connection.TcpNioConnectionReadTests.whileOpen(TcpNioConnectionReadTests.java:536)
	at org.springframework.integration.ip.tcp.connection.TcpNioConnectionReadTests.testReadStxEtxOverflow(TcpNioConnectionReadTests.java:282)
	at sun.reflect.NativeMethodAccessorImpl.invoke0(Native Method)
	at sun.reflect.NativeMethodAccessorImpl.invoke(NativeMethodAccessorImpl.java:62)
	at sun.reflect.DelegatingMethodAccessorImpl.invoke(DelegatingMethodAccessorImpl.java:43)
(44 more lines...)