Disabled until Spring Framework (Stomp) Upgrades to Reactor 3

Build: #1025 failed

Job: Default Job failed

Stages & jobs

  1. Default Stage

Job result summary

Completed
Duration
19 minutes
Agent
bamboo-23.af.pivotal.io
Revision
0cbea82946dee0692d3389a8dcd0174e9ca8bfeb 0cbea82946dee0692d3389a8dcd0174e9ca8bfeb
Total tests
5143
Fixed in
#1026 (Scheduled)

Tests

  • 5,143 tests in total
  • 1 test failed
  • 1 failure is new
  • 135 tests were quarantined / skipped
  • 13 minutes taken in total.
New test failures 1
Status Test Duration
Collapse Failed TcpNioConnectionReadTests testReadStxEtxOverflow History
10 secs
java.lang.AssertionError: java.lang.AssertionError
java.lang.AssertionError
	at org.junit.Assert.fail(Assert.java:86)
	at org.junit.Assert.assertTrue(Assert.java:41)
	at org.junit.Assert.assertTrue(Assert.java:52)
	at org.springframework.integration.ip.tcp.connection.TcpNioConnectionReadTests.testReadStxEtxOverflow(TcpNioConnectionReadTests.java:285)
	at sun.reflect.NativeMethodAccessorImpl.invoke0(Native Method)
	at sun.reflect.NativeMethodAccessorImpl.invoke(NativeMethodAccessorImpl.java:62)
(45 more lines...)

Error summary

The build generated some errors. See the full build log for more details.

POM relocation to an other version number is not fully supported in Gradle : xml-apis:xml-apis:2.0.2 relocated to xml-apis:xml-apis:1.0.b2.
/opt/users/bamboo/.gradle/caches/modules-2/files-2.1/org.springframework/spring-core/5.0.13.BUILD-SNAPSHOT/ea04a8e2d654f7cbeeae9bf11d5d5a08764c5ccb/spring-core-5.0.13.BUILD-SNAPSHOT.jar(org/springframework/lang/Nullable.class): warning: Cannot find annotation method 'when()' in type 'Nonnull': class file for javax.annotation.Nonnull not found
warning: unknown enum constant When.MAYBE
  reason: class file for javax.annotation.meta.When not found
2 warnings
/opt/users/bamboo/.gradle/caches/modules-2/files-2.1/org.springframework/spring-core/5.0.15.RELEASE/5e8a79ed0993d745c1f585a3b165553959b3a06a/spring-core-5.0.15.RELEASE.jar(org/springframework/lang/Nullable.class): warning: Cannot find annotation method 'when()' in type 'Nonnull': class file for javax.annotation.Nonnull not found
warning: unknown enum constant When.MAYBE
  reason: class file for javax.annotation.meta.When not found
2 warnings
warning: unknown enum constant When.MAYBE
  reason: class file for javax.annotation.meta.When not found
warning: unknown enum constant When.MAYBE
  reason: class file for javax.annotation.meta.When not found
warning: unknown enum constant When.MAYBE
  reason: class file for javax.annotation.meta.When not found
3 warnings
*** java.lang.instrument ASSERTION FAILED ***: "!errorOutstanding" with message transform method call failed at JPLISAgent.c line: 844
*** java.lang.instrument ASSERTION FAILED ***: "!errorOutstanding" with message transform method call failed at JPLISAgent.c line: 844
*** java.lang.instrument ASSERTION FAILED ***: "!errorOutstanding" with message transform method call failed at JPLISAgent.c line: 844
*** java.lang.instrument ASSERTION FAILED ***: "!errorOutstanding" with message transform method call failed at JPLISAgent.c line: 844
/opt/users/bamboo/.gradle/caches/modules-2/files-2.1/org.springframework/spring-core/5.0.13.BUILD-SNAPSHOT/ea04a8e2d654f7cbeeae9bf11d5d5a08764c5ccb/spring-core-5.0.13.BUILD-SNAPSHOT.jar(org/springframework/lang/Nullable.class): warning: Cannot find annotation method 'when()' in type 'Nonnull': class file for javax.annotation.Nonnull not found
warning: unknown enum constant When.MAYBE
  reason: class file for javax.annotation.meta.When not found
2 warnings

301 tests completed, 1 failed, 4 skipped
/opt/users/bamboo/.gradle/caches/modules-2/files-2.1/org.springframework/spring-core/5.0.13.BUILD-SNAPSHOT/ea04a8e2d654f7cbeeae9bf11d5d5a08764c5ccb/spring-core-5.0.13.BUILD-SNAPSHOT.jar(org/springframework/lang/Nullable.class): warning: Cannot find annotation method 'when()' in type 'Nonnull': class file for javax.annotation.Nonnull not found
warning: unknown enum constant When.MAYBE
  reason: class file for javax.annotation.meta.When not found
2 warnings
/opt/users/bamboo/.gradle/caches/modules-2/files-2.1/org.springframework/spring-core/5.0.13.BUILD-SNAPSHOT/ea04a8e2d654f7cbeeae9bf11d5d5a08764c5ccb/spring-core-5.0.13.BUILD-SNAPSHOT.jar(org/springframework/lang/Nullable.class): warning: Cannot find annotation method 'when()' in type 'Nonnull': class file for javax.annotation.Nonnull not found
warning: unknown enum constant When.MAYBE
  reason: class file for javax.annotation.meta.When not found
2 warnings

FAILURE: Build failed with an exception.

* What went wrong:
Execution failed for task ':spring-integration-ip:springIoJdk8Test'.
> There were failing tests. See the report at: file:///opt/bamboo-home/xml-data/build-dir/INT-FATS5IC-JOB1/spring-integration-ip/build/reports/spring-io-jdk8-tests/index.html

* Try:
Run with --stacktrace option to get the stack trace. Run with --info or --debug option to get more log output. Run with --scan to get full insights.

* Get more help at https://help.gradle.org

BUILD FAILED in 19m 13s