Build: #4 failed Changes by Alexander Pinske <[email protected]>

Build result summary

Details

Completed
Duration
25 minutes
Labels
None
Revision
3c27241d31a08e84753732fb4aaa900e7e328f66 3c27241d31a08e84753732fb4aaa900e7e328f66
Total tests
5003
Fixed in
#5 (Rebuilt by Artem Bilan)

Tests

Responsible

No one has taken responsibility for this failure

Code commits

Author Commit Message Commit date
Alexander Pinske <alex@pinske.eu> Alexander Pinske <[email protected]> 3c27241d31a08e84753732fb4aaa900e7e328f66 3c27241d31a08e84753732fb4aaa900e7e328f66 Improve IMAP IDLE tests
This forces the race condition that was fixed in #3535 consistently.
Before the `IdleCanceler` was used to cancel the `idle()` call in addition to the normal flow.
That should not be necessary any more.

Tests

New test failures 2
Status Test View job Duration
Collapse Failed DispatcherHasNoSubscribersTests withNoContext History
Default Job < 1 sec
java.lang.IllegalStateException: java.lang.IllegalStateException: Failed to load ApplicationContext
java.lang.IllegalStateException: Failed to load ApplicationContext
	at org.springframework.test.context.cache.DefaultCacheAwareContextLoaderDelegate.loadContext(DefaultCacheAwareContextLoaderDelegate.java:132)
	at org.springframework.test.context.support.DefaultTestContext.getApplicationContext(DefaultTestContext.java:124)
	at org.springframework.test.context.support.DependencyInjectionTestExecutionListener.injectDependencies(DependencyInjectionTestExecutionListener.java:118)
	at org.springframework.test.context.support.DependencyInjectionTestExecutionListener.prepareTestInstance(DependencyInjectionTestExecutionListener.java:83)
	at org.springframework.test.context.TestContextManager.prepareTestInstance(TestContextManager.java:244)
	at org.springframework.test.context.junit4.SpringJUnit4ClassRunner.createTest(SpringJUnit4ClassRunner.java:227)
(83 more lines...)
Collapse Failed StompServerIntegrationTests testStompAdapters() History
Default Job 12 secs
java.lang.AssertionError: java.lang.AssertionError: 
Expecting actual not to be null
java.lang.AssertionError: 
Expecting actual not to be null
	at org.springframework.integration.stomp.client.StompServerIntegrationTests.testStompAdapters(StompServerIntegrationTests.java:220)
	at java.base/jdk.internal.reflect.NativeMethodAccessorImpl.invoke0(Native Method)
	at java.base/jdk.internal.reflect.NativeMethodAccessorImpl.invoke(NativeMethodAccessorImpl.java:62)
	at java.base/jdk.internal.reflect.DelegatingMethodAccessorImpl.invoke(DelegatingMethodAccessorImpl.java:43)
(87 more lines...)