Build: #34 failed

Job: Default Job failed

Stages & jobs

  1. Default Stage

Build log

The build generated 1,543 lines of output.The output is too long and has been truncated to the last 1,000 lines. Download or view full build log

11-May-2021 21:44:50 > Task :spring-integration-ftp:test
11-May-2021 21:45:05 > Task :spring-integration-file:check
11-May-2021 21:45:05 > Task :spring-integration-file:build
11-May-2021 21:45:09 > Task :spring-integration-gemfire:javadoc
11-May-2021 21:45:09 > Task :spring-integration-gemfire:javadocJar
11-May-2021 21:45:09 > Task :spring-integration-gemfire:assemble
11-May-2021 21:45:09 > Task :spring-integration-gemfire:checkstyleMain
11-May-2021 21:45:09 > Task :spring-integration-gemfire:compileTestKotlin
11-May-2021 21:45:11 > Task :spring-integration-gemfire:compileTestJava
11-May-2021 21:45:11 > Task :spring-integration-gemfire:testClasses
11-May-2021 21:45:11 > Task :spring-integration-gemfire:checkstyleTest
11-May-2021 21:45:15 > Task :spring-integration-ftp:check
11-May-2021 21:45:15 > Task :spring-integration-ftp:build
11-May-2021 21:45:15 > Task :spring-integration-scripting:compileKotlin
11-May-2021 21:45:15 > Task :spring-integration-scripting:compileJava
11-May-2021 21:45:15 > Task :spring-integration-groovy:compileKotlin
11-May-2021 21:45:16 > Task :spring-integration-groovy:compileJava
11-May-2021 21:45:16 > Task :spring-integration-groovy:classes
11-May-2021 21:45:16 > Task :spring-integration-groovy:inspectClassesForKotlinIC
11-May-2021 21:45:17 > Task :spring-integration-groovy:jar
11-May-2021 21:45:24 > Task :spring-integration-groovy:javadoc
11-May-2021 21:45:24 > Task :spring-integration-groovy:javadocJar
11-May-2021 21:45:24 > Task :spring-integration-groovy:assemble
11-May-2021 21:45:24 > Task :spring-integration-groovy:checkstyleMain
11-May-2021 21:45:24 > Task :spring-integration-groovy:compileTestKotlin
11-May-2021 21:45:25 > Task :spring-integration-groovy:compileTestJava
11-May-2021 21:45:25 > Task :spring-integration-groovy:testClasses
11-May-2021 21:45:26 > Task :spring-integration-groovy:checkstyleTest
11-May-2021 21:45:26 > Task :spring-integration-scripting:classes
11-May-2021 21:45:26 > Task :spring-integration-scripting:inspectClassesForKotlinIC
11-May-2021 21:45:26 > Task :spring-integration-scripting:jar
11-May-2021 21:45:41 > Task :spring-integration-gemfire:test
11-May-2021 21:45:56 > Task :spring-integration-groovy:test
11-May-2021 21:46:08 > Task :spring-integration-groovy:check
11-May-2021 21:46:08 > Task :spring-integration-groovy:build
11-May-2021 21:46:09 > Task :spring-integration-http:compileKotlin
11-May-2021 21:46:11 > Task :spring-integration-gemfire:check
11-May-2021 21:46:11 > Task :spring-integration-gemfire:build
11-May-2021 21:46:12 > Task :spring-integration-security:compileKotlin
11-May-2021 21:46:12 > Task :spring-integration-http:compileJava
11-May-2021 21:46:12 > Task :spring-integration-http:classes
11-May-2021 21:46:12 > Task :spring-integration-http:inspectClassesForKotlinIC
11-May-2021 21:46:12 > Task :spring-integration-http:jar
11-May-2021 21:46:12 > Task :spring-integration-security:compileJava
11-May-2021 21:46:12 > Task :spring-integration-security:classes
11-May-2021 21:46:12 > Task :spring-integration-security:inspectClassesForKotlinIC
11-May-2021 21:46:12 > Task :spring-integration-security:jar
11-May-2021 21:46:12 > Task :spring-integration-ip:compileKotlin
11-May-2021 21:46:14 > Task :spring-integration-ip:compileJava
11-May-2021 21:46:14 > Task :spring-integration-ip:classes
11-May-2021 21:46:14 > Task :spring-integration-ip:inspectClassesForKotlinIC
11-May-2021 21:46:14 > Task :spring-integration-ip:jar
11-May-2021 21:46:21 > Task :spring-integration-http:javadoc
11-May-2021 21:46:21 > Task :spring-integration-http:javadocJar
11-May-2021 21:46:21 > Task :spring-integration-http:assemble
11-May-2021 21:46:23 > Task :spring-integration-http:checkstyleMain
11-May-2021 21:46:27 > Task :spring-integration-ip:javadoc
11-May-2021 21:46:28 > Task :spring-integration-ip:javadocJar
11-May-2021 21:46:28 > Task :spring-integration-ip:assemble
11-May-2021 21:46:30 > Task :spring-integration-http:compileTestKotlin
11-May-2021 21:46:30 > Task :spring-integration-ip:checkstyleMain
11-May-2021 21:46:30 > Task :spring-integration-ip:compileTestKotlin
11-May-2021 21:46:37 > Task :spring-integration-ip:compileTestJava
11-May-2021 21:46:37 > Task :spring-integration-ip:testClasses
11-May-2021 21:46:38 > Task :spring-integration-http:compileTestJava
11-May-2021 21:46:38 > Task :spring-integration-http:testClasses
11-May-2021 21:46:40 > Task :spring-integration-http:checkstyleTest
11-May-2021 21:46:42 > Task :spring-integration-ip:checkstyleTest
11-May-2021 21:46:54
11-May-2021 21:46:54 *** java.lang.instrument ASSERTION FAILED ***: "!errorOutstanding" with message transform method call failed at ./src/java.instrument/share/native/libinstrument/JPLISAgent.c line: 873
11-May-2021 21:46:54 > Task :spring-integration-core:test
11-May-2021 21:46:54 *** java.lang.instrument ASSERTION FAILED ***: "!errorOutstanding" with message transform method call failed at ./src/java.instrument/share/native/libinstrument/JPLISAgent.c line: 873
11-May-2021 21:46:54 *** java.lang.instrument ASSERTION FAILED ***: "!errorOutstanding" with message transform method call failed at ./src/java.instrument/share/native/libinstrument/JPLISAgent.c line: 873
11-May-2021 21:46:54 *** java.lang.instrument ASSERTION FAILED ***: "!errorOutstanding" with message transform method call failed at ./src/java.instrument/share/native/libinstrument/JPLISAgent.c line: 873
11-May-2021 21:47:10
11-May-2021 21:47:10 > Task :spring-integration-http:test
11-May-2021 21:47:12 > Task :spring-integration-ip:test
11-May-2021 21:47:22 WARNING: An illegal reflective access operation has occurred
11-May-2021 21:47:22 WARNING: Illegal reflective access by org.springframework.util.ReflectionUtils (file:/opt/users/bamboo/.gradle/caches/modules-2/files-2.1/org.springframework/spring-core/5.3.7-SNAPSHOT/c5b4e78a93fb7d9706c0cffe7354230c5b4372df/spring-core-5.3.7-SNAPSHOT.jar) to field java.nio.channels.spi.AbstractInterruptibleChannel.closed
11-May-2021 21:47:22 WARNING: Please consider reporting this to the maintainers of org.springframework.util.ReflectionUtils
11-May-2021 21:47:22 WARNING: Use --illegal-access=warn to enable warnings of further illegal reflective access operations
11-May-2021 21:47:22 WARNING: All illegal access operations will be denied in a future release
11-May-2021 21:47:27
11-May-2021 21:47:27 > Task :spring-integration-http:check
11-May-2021 21:47:27 > Task :spring-integration-http:build
11-May-2021 21:47:35 > Task :spring-integration-jdbc:javadoc
11-May-2021 21:47:35 > Task :spring-integration-jdbc:javadocJar
11-May-2021 21:47:35 > Task :spring-integration-jdbc:assemble
11-May-2021 21:47:36 > Task :spring-integration-jdbc:checkstyleMain
11-May-2021 21:47:38 > Task :spring-integration-jdbc:compileTestKotlin
11-May-2021 21:47:43 > Task :spring-integration-jdbc:compileTestJava
11-May-2021 21:47:43 > Task :spring-integration-jdbc:testClasses
11-May-2021 21:47:45 > Task :spring-integration-jdbc:checkstyleTest
11-May-2021 21:48:15 > Task :spring-integration-jdbc:test
11-May-2021 21:48:16 WARNING: An illegal reflective access operation has occurred
11-May-2021 21:48:16 WARNING: Illegal reflective access by org.springframework.util.ReflectionUtils (file:/opt/users/bamboo/.gradle/caches/modules-2/files-2.1/org.springframework/spring-core/5.3.7-SNAPSHOT/c5b4e78a93fb7d9706c0cffe7354230c5b4372df/spring-core-5.3.7-SNAPSHOT.jar) to constructor java.lang.invoke.MethodHandles$Lookup(java.lang.Class)
11-May-2021 21:48:16 WARNING: Please consider reporting this to the maintainers of org.springframework.util.ReflectionUtils
11-May-2021 21:48:16 WARNING: Use --illegal-access=warn to enable warnings of further illegal reflective access operations
11-May-2021 21:48:16 WARNING: All illegal access operations will be denied in a future release
11-May-2021 21:48:31
11-May-2021 21:48:31 > Task :spring-integration-ip:check
11-May-2021 21:48:31 > Task :spring-integration-ip:build
11-May-2021 21:48:31 > Task :spring-integration-jms:compileKotlin
11-May-2021 21:48:32 > Task :spring-integration-jms:compileJava
11-May-2021 21:48:32 > Task :spring-integration-jms:classes
11-May-2021 21:48:32 > Task :spring-integration-jms:inspectClassesForKotlinIC
11-May-2021 21:48:32 > Task :spring-integration-jms:jar
11-May-2021 21:48:41 > Task :spring-integration-jms:javadoc
11-May-2021 21:48:41 > Task :spring-integration-jms:javadocJar
11-May-2021 21:48:41 > Task :spring-integration-jms:assemble
11-May-2021 21:48:42 > Task :spring-integration-jms:checkstyleMain
11-May-2021 21:48:45 > Task :spring-integration-jms:compileTestKotlin
11-May-2021 21:48:48 > Task :spring-integration-jms:compileTestJava
11-May-2021 21:48:48 > Task :spring-integration-jms:testClasses
11-May-2021 21:48:49 > Task :spring-integration-jms:checkstyleTest
11-May-2021 21:49:12
11-May-2021 21:49:12 May 11, 2021 9:49:12 PM uri:classloader:/gems/asciidoctor-2.0.12/lib/asciidoctor/convert.rb convert
11-May-2021 21:49:12 > Task :asciidoctorPdf
11-May-2021 21:49:12 WARNING: /opt/bamboo-home/xml-data/build-dir/INT-MAIN-JOB1/build/asciidoc/index-single.adoc: stylesheet does not exist or cannot be read: /opt/bamboo-home/xml-data/build-dir/INT-MAIN-JOB1/build/asciidoc/stylesheet.css
11-May-2021 21:49:15
11-May-2021 21:49:15 > Task :spring-integration-jmx:compileKotlin
11-May-2021 21:49:16 > Task :spring-integration-jmx:compileJava
11-May-2021 21:49:16 > Task :spring-integration-jmx:classes
11-May-2021 21:49:16 > Task :spring-integration-jmx:inspectClassesForKotlinIC
11-May-2021 21:49:16 > Task :spring-integration-jmx:jar
11-May-2021 21:49:17
11-May-2021 21:49:17 WARNING: An illegal reflective access operation has occurred
11-May-2021 21:49:17 > Task :spring-integration-jms:test
11-May-2021 21:49:17 WARNING: Illegal reflective access by org.springframework.util.ReflectionUtils (file:/opt/users/bamboo/.gradle/caches/modules-2/files-2.1/org.springframework/spring-core/5.3.7-SNAPSHOT/c5b4e78a93fb7d9706c0cffe7354230c5b4372df/spring-core-5.3.7-SNAPSHOT.jar) to constructor java.lang.invoke.MethodHandles$Lookup(java.lang.Class)
11-May-2021 21:49:17 WARNING: Please consider reporting this to the maintainers of org.springframework.util.ReflectionUtils
11-May-2021 21:49:17 WARNING: Use --illegal-access=warn to enable warnings of further illegal reflective access operations
11-May-2021 21:49:17 WARNING: All illegal access operations will be denied in a future release
11-May-2021 21:49:22
11-May-2021 21:49:22 > Task :spring-integration-jmx:javadoc
11-May-2021 21:49:22 > Task :spring-integration-jmx:javadocJar
11-May-2021 21:49:22 > Task :spring-integration-jmx:assemble
11-May-2021 21:49:22 > Task :spring-integration-jmx:checkstyleMain
11-May-2021 21:49:24 > Task :spring-integration-jmx:compileTestKotlin
11-May-2021 21:49:27 > Task :spring-integration-jmx:compileTestJava
11-May-2021 21:49:27 > Task :spring-integration-jmx:testClasses
11-May-2021 21:49:27 > Task :spring-integration-jmx:checkstyleTest
11-May-2021 21:49:44 WARNING: An illegal reflective access operation has occurred
11-May-2021 21:49:44 WARNING: Illegal reflective access by org.springframework.util.ReflectionUtils (file:/opt/users/bamboo/.gradle/caches/modules-2/files-2.1/org.springframework/spring-core/5.3.7-SNAPSHOT/c5b4e78a93fb7d9706c0cffe7354230c5b4372df/spring-core-5.3.7-SNAPSHOT.jar) to constructor java.lang.invoke.MethodHandles$Lookup(java.lang.Class)
11-May-2021 21:49:44 WARNING: Please consider reporting this to the maintainers of org.springframework.util.ReflectionUtils
11-May-2021 21:49:44 WARNING: Use --illegal-access=warn to enable warnings of further illegal reflective access operations
11-May-2021 21:49:44 WARNING: All illegal access operations will be denied in a future release
11-May-2021 21:49:44
11-May-2021 21:49:44 > Task :spring-integration-jmx:test
11-May-2021 21:49:49
11-May-2021 21:49:49 > Task :spring-integration-jdbc:check
11-May-2021 21:49:49 > Task :spring-integration-jdbc:build
11-May-2021 21:49:49 > Task :spring-integration-jpa:compileKotlin
11-May-2021 21:49:49 > Task :spring-integration-jpa:compileJava
11-May-2021 21:49:49 > Task :spring-integration-jpa:classes
11-May-2021 21:49:50 > Task :spring-integration-jpa:inspectClassesForKotlinIC
11-May-2021 21:49:50 > Task :spring-integration-jpa:jar
11-May-2021 21:49:56 > Task :spring-integration-jpa:javadoc
11-May-2021 21:49:57 > Task :spring-integration-jpa:javadocJar
11-May-2021 21:49:57 > Task :spring-integration-jpa:assemble
11-May-2021 21:49:57 > Task :spring-integration-jpa:checkstyleMain
11-May-2021 21:50:02 > Task :spring-integration-jpa:compileTestKotlin
11-May-2021 21:50:04 > Task :spring-integration-jpa:compileTestJava
11-May-2021 21:50:04 > Task :spring-integration-jpa:testClasses
11-May-2021 21:50:05 > Task :spring-integration-jpa:checkstyleTest
11-May-2021 21:50:12 > Task :spring-integration-jms:check
11-May-2021 21:50:12 > Task :spring-integration-jms:build
11-May-2021 21:50:12 > Task :spring-integration-kafka:compileKotlin
11-May-2021 21:50:15 > Task :spring-integration-kafka:compileJava
11-May-2021 21:50:15 > Task :spring-integration-kafka:classes
11-May-2021 21:50:15 > Task :spring-integration-kafka:inspectClassesForKotlinIC
11-May-2021 21:50:15 > Task :spring-integration-kafka:jar
11-May-2021 21:50:20 > Task :spring-integration-jmx:check
11-May-2021 21:50:20 > Task :spring-integration-jmx:build
11-May-2021 21:50:20 > Task :spring-integration-mail:compileKotlin
11-May-2021 21:50:21 > Task :spring-integration-mail:compileJava
11-May-2021 21:50:21 > Task :spring-integration-mail:classes
11-May-2021 21:50:21 > Task :spring-integration-mail:inspectClassesForKotlinIC
11-May-2021 21:50:21 > Task :spring-integration-mail:jar
11-May-2021 21:50:27 > Task :spring-integration-kafka:javadoc
11-May-2021 21:50:28 > Task :spring-integration-kafka:javadocJar
11-May-2021 21:50:28 > Task :spring-integration-kafka:assemble
11-May-2021 21:50:29 > Task :spring-integration-kafka:checkstyleMain
11-May-2021 21:50:29 > Task :spring-integration-mail:javadoc
11-May-2021 21:50:29 > Task :spring-integration-mail:javadocJar
11-May-2021 21:50:29 > Task :spring-integration-mail:assemble
11-May-2021 21:50:30 > Task :spring-integration-mail:checkstyleMain
11-May-2021 21:50:30 > Task :spring-integration-mail:compileTestKotlin
11-May-2021 21:50:32 > Task :spring-integration-mail:compileTestJava
11-May-2021 21:50:32 > Task :spring-integration-mail:testClasses
11-May-2021 21:50:33 > Task :spring-integration-mail:checkstyleTest
11-May-2021 21:50:35 > Task :spring-integration-jpa:test
11-May-2021 21:50:42 > Task :spring-integration-kafka:compileTestKotlin
11-May-2021 21:50:46 > Task :spring-integration-kafka:compileTestJava
11-May-2021 21:50:46 > Task :spring-integration-kafka:testClasses
11-May-2021 21:50:48 > Task :spring-integration-kafka:checkstyleTest
11-May-2021 21:51:03 > Task :spring-integration-mail:test
11-May-2021 21:51:05
11-May-2021 21:51:05 WARNING: An illegal reflective access operation has occurred
11-May-2021 21:51:05 > Task :spring-integration-jpa:test
11-May-2021 21:51:05 WARNING: Illegal reflective access by org.springframework.util.ReflectionUtils (file:/opt/users/bamboo/.gradle/caches/modules-2/files-2.1/org.springframework/spring-core/5.3.7-SNAPSHOT/c5b4e78a93fb7d9706c0cffe7354230c5b4372df/spring-core-5.3.7-SNAPSHOT.jar) to constructor java.lang.invoke.MethodHandles$Lookup(java.lang.Class)
11-May-2021 21:51:05 WARNING: Please consider reporting this to the maintainers of org.springframework.util.ReflectionUtils
11-May-2021 21:51:05 WARNING: Use --illegal-access=warn to enable warnings of further illegal reflective access operations
11-May-2021 21:51:05 WARNING: All illegal access operations will be denied in a future release
11-May-2021 21:51:07
11-May-2021 21:51:07 > Task :spring-integration-jpa:check
11-May-2021 21:51:07 > Task :spring-integration-jpa:build
11-May-2021 21:51:08 > Task :spring-integration-mongodb:compileKotlin
11-May-2021 21:51:10 > Task :spring-integration-mongodb:compileJava
11-May-2021 21:51:10 > Task :spring-integration-mongodb:classes
11-May-2021 21:51:10 > Task :spring-integration-mongodb:inspectClassesForKotlinIC
11-May-2021 21:51:10 > Task :spring-integration-mongodb:jar
11-May-2021 21:51:18 > Task :spring-integration-mongodb:javadoc
11-May-2021 21:51:18 > Task :spring-integration-kafka:test
11-May-2021 21:51:18 > Task :spring-integration-mongodb:javadocJar
11-May-2021 21:51:18 > Task :spring-integration-mongodb:assemble
11-May-2021 21:51:19 > Task :spring-integration-mongodb:checkstyleMain
11-May-2021 21:51:19 > Task :spring-integration-mongodb:compileTestKotlin
11-May-2021 21:51:21 > Task :spring-integration-mongodb:compileTestJava
11-May-2021 21:51:21 > Task :spring-integration-mongodb:testClasses
11-May-2021 21:51:22 > Task :spring-integration-mail:check
11-May-2021 21:51:22 > Task :spring-integration-mail:build
11-May-2021 21:51:22 > Task :spring-integration-mqtt:compileKotlin
11-May-2021 21:51:22 > Task :spring-integration-mqtt:compileJava
11-May-2021 21:51:22 > Task :spring-integration-mqtt:classes
11-May-2021 21:51:22 > Task :spring-integration-mqtt:inspectClassesForKotlinIC
11-May-2021 21:51:22 > Task :spring-integration-mqtt:jar
11-May-2021 21:51:22 > Task :spring-integration-mongodb:checkstyleTest
11-May-2021 21:51:30 > Task :spring-integration-mqtt:javadoc
11-May-2021 21:51:30 > Task :spring-integration-mqtt:javadocJar
11-May-2021 21:51:30 > Task :spring-integration-mqtt:assemble
11-May-2021 21:51:30 > Task :spring-integration-mqtt:checkstyleMain
11-May-2021 21:51:30 > Task :spring-integration-mqtt:compileTestKotlin
11-May-2021 21:51:33 > Task :spring-integration-mqtt:compileTestJava
11-May-2021 21:51:33 > Task :spring-integration-mqtt:testClasses
11-May-2021 21:51:33 > Task :spring-integration-mqtt:checkstyleTest
11-May-2021 21:51:46 WARNING: An illegal reflective access operation has occurred
11-May-2021 21:51:46
11-May-2021 21:51:46 WARNING: Illegal reflective access by org.springframework.util.ReflectionUtils (file:/opt/users/bamboo/.gradle/caches/modules-2/files-2.1/org.springframework/spring-core/5.3.7-SNAPSHOT/c5b4e78a93fb7d9706c0cffe7354230c5b4372df/spring-core-5.3.7-SNAPSHOT.jar) to field java.lang.reflect.Proxy.h
11-May-2021 21:51:46 > Task :spring-integration-mongodb:test
11-May-2021 21:51:46 WARNING: Please consider reporting this to the maintainers of org.springframework.util.ReflectionUtils
11-May-2021 21:51:46 WARNING: Use --illegal-access=warn to enable warnings of further illegal reflective access operations
11-May-2021 21:51:46 WARNING: All illegal access operations will be denied in a future release
11-May-2021 21:51:55 WARNING: An illegal reflective access operation has occurred
11-May-2021 21:51:55
11-May-2021 21:51:55 WARNING: Illegal reflective access by org.springframework.util.ReflectionUtils (file:/opt/users/bamboo/.gradle/caches/modules-2/files-2.1/org.springframework/spring-core/5.3.7-SNAPSHOT/c5b4e78a93fb7d9706c0cffe7354230c5b4372df/spring-core-5.3.7-SNAPSHOT.jar) to constructor java.lang.invoke.MethodHandles$Lookup(java.lang.Class)
11-May-2021 21:51:55 > Task :spring-integration-kafka:test
11-May-2021 21:51:55 WARNING: Please consider reporting this to the maintainers of org.springframework.util.ReflectionUtils
11-May-2021 21:51:55 WARNING: Use --illegal-access=warn to enable warnings of further illegal reflective access operations
11-May-2021 21:51:55 WARNING: All illegal access operations will be denied in a future release
11-May-2021 21:52:03 WARNING: An illegal reflective access operation has occurred
11-May-2021 21:52:03
11-May-2021 21:52:03 WARNING: Illegal reflective access by org.springframework.util.ReflectionUtils (file:/opt/users/bamboo/.gradle/caches/modules-2/files-2.1/org.springframework/spring-core/5.3.7-SNAPSHOT/c5b4e78a93fb7d9706c0cffe7354230c5b4372df/spring-core-5.3.7-SNAPSHOT.jar) to field java.lang.reflect.Proxy.h
11-May-2021 21:52:03 > Task :spring-integration-mqtt:test
11-May-2021 21:52:03 WARNING: Please consider reporting this to the maintainers of org.springframework.util.ReflectionUtils
11-May-2021 21:52:03 WARNING: Use --illegal-access=warn to enable warnings of further illegal reflective access operations
11-May-2021 21:52:03 WARNING: All illegal access operations will be denied in a future release
11-May-2021 21:52:11
11-May-2021 21:52:11 > Task :spring-integration-mongodb:check
11-May-2021 21:52:11 > Task :spring-integration-mongodb:build
11-May-2021 21:52:11 > Task :spring-integration-r2dbc:compileKotlin
11-May-2021 21:52:11 > Task :spring-integration-r2dbc:compileJava
11-May-2021 21:52:11 > Task :spring-integration-r2dbc:classes
11-May-2021 21:52:11 > Task :spring-integration-r2dbc:inspectClassesForKotlinIC
11-May-2021 21:52:11 > Task :spring-integration-r2dbc:jar
11-May-2021 21:52:16 > Task :spring-integration-r2dbc:javadoc
11-May-2021 21:52:16 > Task :spring-integration-r2dbc:javadocJar
11-May-2021 21:52:16 > Task :spring-integration-r2dbc:assemble
11-May-2021 21:52:17 > Task :spring-integration-r2dbc:checkstyleMain
11-May-2021 21:52:17 > Task :spring-integration-r2dbc:compileTestKotlin
11-May-2021 21:52:17 > Task :spring-integration-r2dbc:compileTestJava
11-May-2021 21:52:17 > Task :spring-integration-r2dbc:testClasses
11-May-2021 21:52:18 > Task :spring-integration-r2dbc:checkstyleTest
11-May-2021 21:52:26 > Task :spring-integration-kafka:check
11-May-2021 21:52:26 > Task :spring-integration-kafka:build
11-May-2021 21:52:32 > Task :spring-integration-r2dbc:test
11-May-2021 21:52:32 > Task :spring-integration-r2dbc:check
11-May-2021 21:52:32 > Task :spring-integration-r2dbc:build
11-May-2021 21:52:32 > Task :spring-integration-rmi:compileKotlin
11-May-2021 21:52:32 > Task :spring-integration-rmi:compileJava
11-May-2021 21:52:32 > Task :spring-integration-rmi:classes
11-May-2021 21:52:32 > Task :spring-integration-rmi:inspectClassesForKotlinIC
11-May-2021 21:52:32 > Task :spring-integration-rmi:jar
11-May-2021 21:52:35 > Task :spring-integration-redis:javadoc
11-May-2021 21:52:35 > Task :spring-integration-redis:javadocJar
11-May-2021 21:52:35 > Task :spring-integration-redis:assemble
11-May-2021 21:52:36 > Task :spring-integration-redis:checkstyleMain
11-May-2021 21:52:37 > Task :spring-integration-redis:checkstyleTest
11-May-2021 21:52:37 > Task :spring-integration-rmi:javadoc
11-May-2021 21:52:37 > Task :spring-integration-rmi:javadocJar
11-May-2021 21:52:37 > Task :spring-integration-rmi:assemble
11-May-2021 21:52:37 > Task :spring-integration-rmi:checkstyleMain
11-May-2021 21:52:37 > Task :spring-integration-rmi:compileTestKotlin NO-SOURCE
11-May-2021 21:52:37 > Task :spring-integration-rmi:compileTestJava NO-SOURCE
11-May-2021 21:52:37 > Task :spring-integration-rmi:testClasses UP-TO-DATE
11-May-2021 21:52:37 > Task :spring-integration-rmi:checkstyleTest NO-SOURCE
11-May-2021 21:52:37 > Task :spring-integration-rmi:test NO-SOURCE
11-May-2021 21:52:37 > Task :spring-integration-rmi:check
11-May-2021 21:52:37 > Task :spring-integration-rmi:build
11-May-2021 21:52:37 > Task :spring-integration-rsocket:compileKotlin
11-May-2021 21:52:38 > Task :spring-integration-rsocket:compileJava
11-May-2021 21:52:38 > Task :spring-integration-rsocket:classes
11-May-2021 21:52:38 > Task :spring-integration-rsocket:inspectClassesForKotlinIC
11-May-2021 21:52:38 > Task :spring-integration-rsocket:jar
11-May-2021 21:52:45 > Task :spring-integration-rsocket:javadoc
11-May-2021 21:52:46 > Task :spring-integration-rsocket:javadocJar
11-May-2021 21:52:46 > Task :spring-integration-rsocket:assemble
11-May-2021 21:52:46 > Task :spring-integration-rsocket:checkstyleMain
11-May-2021 21:52:46 > Task :spring-integration-rsocket:compileTestKotlin
11-May-2021 21:52:47 > Task :spring-integration-rsocket:compileTestJava
11-May-2021 21:52:47 > Task :spring-integration-rsocket:testClasses
11-May-2021 21:52:48 > Task :spring-integration-rsocket:checkstyleTest
11-May-2021 21:53:04
11-May-2021 21:53:04 > Task :spring-integration-rsocket:test
11-May-2021 21:53:04 WARNING: An illegal reflective access operation has occurred
11-May-2021 21:53:04 WARNING: Illegal reflective access by org.springframework.util.ReflectionUtils (file:/opt/users/bamboo/.gradle/caches/modules-2/files-2.1/org.springframework/spring-core/5.3.7-SNAPSHOT/c5b4e78a93fb7d9706c0cffe7354230c5b4372df/spring-core-5.3.7-SNAPSHOT.jar) to constructor java.lang.invoke.MethodHandles$Lookup(java.lang.Class)
11-May-2021 21:53:04 WARNING: Please consider reporting this to the maintainers of org.springframework.util.ReflectionUtils
11-May-2021 21:53:04 WARNING: Use --illegal-access=warn to enable warnings of further illegal reflective access operations
11-May-2021 21:53:04 WARNING: All illegal access operations will be denied in a future release
11-May-2021 21:53:07
11-May-2021 21:53:07 > Task :spring-integration-redis:test
11-May-2021 21:53:07 > Task :spring-integration-rsocket:check
11-May-2021 21:53:07 > Task :spring-integration-rsocket:build
11-May-2021 21:53:08 > Task :spring-integration-mqtt:check
11-May-2021 21:53:08 > Task :spring-integration-mqtt:build
11-May-2021 21:53:12 > Task :spring-integration-security:javadoc
11-May-2021 21:53:12 > Task :spring-integration-scripting:javadoc
11-May-2021 21:53:12 > Task :spring-integration-security:javadocJar
11-May-2021 21:53:12 > Task :spring-integration-security:assemble
11-May-2021 21:53:12 > Task :spring-integration-scripting:javadocJar
11-May-2021 21:53:12 > Task :spring-integration-scripting:assemble
11-May-2021 21:53:13 > Task :spring-integration-security:checkstyleMain
11-May-2021 21:53:13 > Task :spring-integration-security:compileTestKotlin
11-May-2021 21:53:13 > Task :spring-integration-scripting:checkstyleMain
11-May-2021 21:53:13 > Task :spring-integration-security:compileTestJava
11-May-2021 21:53:13 > Task :spring-integration-security:testClasses
11-May-2021 21:53:13 > Task :spring-integration-security:checkstyleTest
11-May-2021 21:53:15 > Task :spring-integration-scripting:compileTestKotlin
11-May-2021 21:53:17 > Task :spring-integration-scripting:compileTestJava
11-May-2021 21:53:17 > Task :spring-integration-scripting:testClasses
11-May-2021 21:53:17 > Task :spring-integration-scripting:checkstyleTest
11-May-2021 21:53:25
11-May-2021 21:53:25 > Task :spring-integration-security:test
11-May-2021 21:53:25 WARNING: An illegal reflective access operation has occurred
11-May-2021 21:53:25 WARNING: Illegal reflective access by org.springframework.util.ReflectionUtils (file:/opt/users/bamboo/.gradle/caches/modules-2/files-2.1/org.springframework/spring-core/5.3.7-SNAPSHOT/c5b4e78a93fb7d9706c0cffe7354230c5b4372df/spring-core-5.3.7-SNAPSHOT.jar) to constructor java.lang.invoke.MethodHandles$Lookup(java.lang.Class)
11-May-2021 21:53:25 WARNING: Please consider reporting this to the maintainers of org.springframework.util.ReflectionUtils
11-May-2021 21:53:25 WARNING: Use --illegal-access=warn to enable warnings of further illegal reflective access operations
11-May-2021 21:53:25 WARNING: All illegal access operations will be denied in a future release
11-May-2021 21:53:32
11-May-2021 21:53:32 > Task :spring-integration-security:check
11-May-2021 21:53:32 > Task :spring-integration-security:build
11-May-2021 21:53:32 > Task :spring-integration-sftp:compileKotlin
11-May-2021 21:53:32 > Task :spring-integration-sftp:compileJava
11-May-2021 21:53:32 > Task :spring-integration-sftp:classes
11-May-2021 21:53:32 > Task :spring-integration-sftp:inspectClassesForKotlinIC
11-May-2021 21:53:32 > Task :spring-integration-sftp:jar
11-May-2021 21:53:39 > Task :spring-integration-sftp:javadoc
11-May-2021 21:53:39 > Task :spring-integration-sftp:javadocJar
11-May-2021 21:53:39 > Task :spring-integration-sftp:assemble
11-May-2021 21:53:39 > Task :spring-integration-sftp:checkstyleMain
11-May-2021 21:53:39 > Task :spring-integration-sftp:compileTestKotlin
11-May-2021 21:53:43 > Task :spring-integration-sftp:compileTestJava
11-May-2021 21:53:43 > Task :spring-integration-sftp:testClasses
11-May-2021 21:53:44 > Task :spring-integration-sftp:checkstyleTest
11-May-2021 21:53:47 > Task :spring-integration-scripting:test
11-May-2021 21:54:14 > Task :spring-integration-sftp:test
11-May-2021 21:54:25 > Task :spring-integration-sftp:check
11-May-2021 21:54:25 > Task :spring-integration-sftp:build
11-May-2021 21:54:25 > Task :spring-integration-stomp:compileKotlin
11-May-2021 21:54:26 > Task :spring-integration-stomp:compileJava
11-May-2021 21:54:26 > Task :spring-integration-stomp:classes
11-May-2021 21:54:26 > Task :spring-integration-stomp:inspectClassesForKotlinIC
11-May-2021 21:54:26 > Task :spring-integration-stomp:jar
11-May-2021 21:54:31 > Task :spring-integration-stomp:javadoc
11-May-2021 21:54:31 > Task :spring-integration-stomp:javadocJar
11-May-2021 21:54:31 > Task :spring-integration-stomp:assemble
11-May-2021 21:54:31 > Task :spring-integration-stomp:checkstyleMain
11-May-2021 21:54:31 > Task :spring-integration-websocket:compileKotlin
11-May-2021 21:54:32 > Task :spring-integration-websocket:compileJava
11-May-2021 21:54:32 > Task :spring-integration-websocket:classes
11-May-2021 21:54:33 > Task :spring-integration-websocket:compileTestKotlin
11-May-2021 21:54:34 > Task :spring-integration-websocket:compileTestJava
11-May-2021 21:54:34 > Task :spring-integration-websocket:testClasses
11-May-2021 21:54:34 > Task :spring-integration-stomp:compileTestKotlin
11-May-2021 21:54:35 > Task :spring-integration-stomp:compileTestJava
11-May-2021 21:54:35 > Task :spring-integration-stomp:testClasses
11-May-2021 21:54:36 > Task :spring-integration-stomp:checkstyleTest
11-May-2021 21:54:36 > Task :spring-integration-websocket:inspectClassesForKotlinIC
11-May-2021 21:54:36 > Task :spring-integration-websocket:jar
11-May-2021 21:54:43 > Task :spring-integration-scripting:check
11-May-2021 21:54:43 > Task :spring-integration-scripting:build
11-May-2021 21:54:48 > Task :spring-integration-stream:javadoc
11-May-2021 21:54:48 > Task :spring-integration-stream:javadocJar
11-May-2021 21:54:48 > Task :spring-integration-stream:assemble
11-May-2021 21:54:48 > Task :spring-integration-stream:checkstyleMain
11-May-2021 21:54:48 > Task :spring-integration-stream:compileTestKotlin
11-May-2021 21:54:49 > Task :spring-integration-stream:compileTestJava
11-May-2021 21:54:49 > Task :spring-integration-stream:testClasses
11-May-2021 21:54:49 > Task :spring-integration-stream:checkstyleTest
11-May-2021 21:54:53
11-May-2021 21:54:53 > Task :spring-integration-stomp:test
11-May-2021 21:54:53 WARNING: An illegal reflective access operation has occurred
11-May-2021 21:54:53 WARNING: Illegal reflective access by org.apache.catalina.loader.WebappClassLoaderBase (file:/opt/users/bamboo/.gradle/caches/modules-2/files-2.1/org.apache.tomcat.embed/tomcat-embed-core/9.0.45/8fb7d78b14e2deb8fec430498c64418ec0a2d983/tomcat-embed-core-9.0.45.jar) to field java.io.ObjectStreamClass$Caches.localDescs
11-May-2021 21:54:53 WARNING: Please consider reporting this to the maintainers of org.apache.catalina.loader.WebappClassLoaderBase
11-May-2021 21:54:53 WARNING: Use --illegal-access=warn to enable warnings of further illegal reflective access operations
11-May-2021 21:54:53 WARNING: All illegal access operations will be denied in a future release
11-May-2021 21:55:02
11-May-2021 21:55:02 > Task :spring-integration-stream:test
11-May-2021 21:55:02
11-May-2021 21:55:02 > Task :spring-integration-stream:check
11-May-2021 21:55:02 > Task :spring-integration-stream:build
11-May-2021 21:55:02 > Task :spring-integration-syslog:compileKotlin
11-May-2021 21:55:02 WARNING: An illegal reflective access operation has occurred
11-May-2021 21:55:02 WARNING: Illegal reflective access by org.springframework.util.ReflectionUtils (file:/opt/users/bamboo/.gradle/caches/modules-2/files-2.1/org.springframework/spring-core/5.3.7-SNAPSHOT/c5b4e78a93fb7d9706c0cffe7354230c5b4372df/spring-core-5.3.7-SNAPSHOT.jar) to field java.io.BufferedReader.in
11-May-2021 21:55:02 WARNING: Please consider reporting this to the maintainers of org.springframework.util.ReflectionUtils
11-May-2021 21:55:02 WARNING: Use --illegal-access=warn to enable warnings of further illegal reflective access operations
11-May-2021 21:55:02 WARNING: All illegal access operations will be denied in a future release
11-May-2021 21:55:03 > Task :spring-integration-syslog:compileJava
11-May-2021 21:55:03 > Task :spring-integration-syslog:classes
11-May-2021 21:55:03 > Task :spring-integration-syslog:inspectClassesForKotlinIC
11-May-2021 21:55:03 > Task :spring-integration-stomp:check
11-May-2021 21:55:03 > Task :spring-integration-stomp:build
11-May-2021 21:55:03 > Task :spring-integration-syslog:jar
11-May-2021 21:55:03 > Task :spring-integration-test:compileKotlin
11-May-2021 21:55:03 > Task :spring-integration-test:compileJava
11-May-2021 21:55:03 > Task :spring-integration-test:classes
11-May-2021 21:55:03 > Task :spring-integration-test:inspectClassesForKotlinIC
11-May-2021 21:55:03 > Task :spring-integration-test:jar
11-May-2021 21:55:07 > Task :spring-integration-test:javadoc
11-May-2021 21:55:07 > Task :spring-integration-syslog:javadoc
11-May-2021 21:55:07 > Task :spring-integration-test:javadocJar
11-May-2021 21:55:07 > Task :spring-integration-test:assemble
11-May-2021 21:55:08 > Task :spring-integration-syslog:javadocJar
11-May-2021 21:55:08 > Task :spring-integration-syslog:assemble
11-May-2021 21:55:08 > Task :spring-integration-test:checkstyleMain
11-May-2021 21:55:08 > Task :spring-integration-test:compileTestKotlin
11-May-2021 21:55:08 > Task :spring-integration-syslog:checkstyleMain
11-May-2021 21:55:08 > Task :spring-integration-syslog:compileTestKotlin
11-May-2021 21:55:08 > Task :spring-integration-syslog:compileTestJava
11-May-2021 21:55:08 > Task :spring-integration-syslog:testClasses
11-May-2021 21:55:08 > Task :spring-integration-test:compileTestJava
11-May-2021 21:55:08 > Task :spring-integration-test:testClasses
11-May-2021 21:55:09 > Task :spring-integration-test:checkstyleTest
11-May-2021 21:55:09 > Task :spring-integration-syslog:checkstyleTest
11-May-2021 21:55:26 > Task :spring-integration-test:test
11-May-2021 21:55:26 > Task :spring-integration-test:check
11-May-2021 21:55:26 > Task :spring-integration-test:build
11-May-2021 21:55:26 > Task :spring-integration-webflux:compileKotlin
11-May-2021 21:55:27 > Task :spring-integration-webflux:compileJava
11-May-2021 21:55:27 > Task :spring-integration-webflux:classes
11-May-2021 21:55:27 > Task :spring-integration-webflux:inspectClassesForKotlinIC
11-May-2021 21:55:27 > Task :spring-integration-webflux:jar
11-May-2021 21:55:28 > Task :spring-integration-syslog:test
11-May-2021 21:55:28 > Task :spring-integration-syslog:check
11-May-2021 21:55:28 > Task :spring-integration-syslog:build
11-May-2021 21:55:33 > Task :spring-integration-webflux:javadoc
11-May-2021 21:55:33 > Task :spring-integration-websocket:javadoc
11-May-2021 21:55:33 > Task :spring-integration-webflux:javadocJar
11-May-2021 21:55:33 > Task :spring-integration-webflux:assemble
11-May-2021 21:55:33 > Task :spring-integration-websocket:javadocJar
11-May-2021 21:55:33 > Task :spring-integration-websocket:assemble
11-May-2021 21:55:33 > Task :spring-integration-webflux:checkstyleMain
11-May-2021 21:55:33 > Task :spring-integration-webflux:compileTestKotlin
11-May-2021 21:55:34 > Task :spring-integration-websocket:checkstyleMain
11-May-2021 21:55:34 > Task :spring-integration-webflux:compileTestJava
11-May-2021 21:55:34 > Task :spring-integration-webflux:testClasses
11-May-2021 21:55:34 > Task :spring-integration-websocket:checkstyleTest
11-May-2021 21:55:34 > Task :spring-integration-webflux:checkstyleTest
11-May-2021 21:55:53
11-May-2021 21:55:53 > Task :spring-integration-websocket:test
11-May-2021 21:55:53 WARNING: An illegal reflective access operation has occurred
11-May-2021 21:55:53 WARNING: Illegal reflective access by org.apache.catalina.loader.WebappClassLoaderBase (file:/opt/users/bamboo/.gradle/caches/modules-2/files-2.1/org.apache.tomcat.embed/tomcat-embed-core/9.0.45/8fb7d78b14e2deb8fec430498c64418ec0a2d983/tomcat-embed-core-9.0.45.jar) to field java.io.ObjectStreamClass$Caches.localDescs
11-May-2021 21:55:53 WARNING: Please consider reporting this to the maintainers of org.apache.catalina.loader.WebappClassLoaderBase
11-May-2021 21:55:53 WARNING: Use --illegal-access=warn to enable warnings of further illegal reflective access operations
11-May-2021 21:55:53 WARNING: All illegal access operations will be denied in a future release
11-May-2021 21:56:04
11-May-2021 21:56:04 > Task :spring-integration-webflux:test
11-May-2021 21:56:05 > Task :spring-integration-webflux:check
11-May-2021 21:56:05 > Task :spring-integration-webflux:build
11-May-2021 21:56:05 > Task :spring-integration-ws:compileKotlin
11-May-2021 21:56:06 > Task :spring-integration-ws:compileJava
11-May-2021 21:56:06 > Task :spring-integration-ws:classes
11-May-2021 21:56:06 > Task :spring-integration-ws:inspectClassesForKotlinIC
11-May-2021 21:56:06 > Task :spring-integration-ws:jar
11-May-2021 21:56:09 > Task :spring-integration-websocket:check
11-May-2021 21:56:09 > Task :spring-integration-websocket:build
11-May-2021 21:56:09 > Task :spring-integration-xml:compileKotlin
11-May-2021 21:56:10 > Task :spring-integration-xml:compileJava
11-May-2021 21:56:10 > Task :spring-integration-xml:classes
11-May-2021 21:56:10 > Task :spring-integration-xml:inspectClassesForKotlinIC
11-May-2021 21:56:10 > Task :spring-integration-xml:jar
11-May-2021 21:56:11 > Task :spring-integration-ws:javadoc
11-May-2021 21:56:11 > Task :spring-integration-ws:javadocJar
11-May-2021 21:56:11 > Task :spring-integration-ws:assemble
11-May-2021 21:56:11 > Task :spring-integration-ws:checkstyleMain
11-May-2021 21:56:14 > Task :spring-integration-ws:compileTestKotlin
11-May-2021 21:56:15 > Task :spring-integration-xml:javadoc
11-May-2021 21:56:16 > Task :spring-integration-xml:javadocJar
11-May-2021 21:56:16 > Task :spring-integration-xml:assemble
11-May-2021 21:56:16 > Task :spring-integration-xml:checkstyleMain
11-May-2021 21:56:17 > Task :spring-integration-ws:compileTestJava
11-May-2021 21:56:17 > Task :spring-integration-ws:testClasses
11-May-2021 21:56:17 > Task :spring-integration-xml:compileTestKotlin
11-May-2021 21:56:17 > Task :spring-integration-ws:checkstyleTest
11-May-2021 21:56:19 > Task :spring-integration-xml:compileTestJava
11-May-2021 21:56:19 > Task :spring-integration-xml:testClasses
11-May-2021 21:56:19 > Task :spring-integration-xml:checkstyleTest
11-May-2021 21:56:36
11-May-2021 21:56:36 > Task :spring-integration-xml:test
11-May-2021 21:56:36 WARNING: An illegal reflective access operation has occurred
11-May-2021 21:56:36 WARNING: Illegal reflective access by org.springframework.xml.transform.TransformerFactoryUtils (file:/opt/users/bamboo/.gradle/caches/modules-2/files-2.1/org.springframework.ws/spring-xml/3.1.0-SNAPSHOT/151083a490533b74eb20aad17afa9a5fb747d986/spring-xml-3.1.0-SNAPSHOT.jar) to constructor com.sun.org.apache.xalan.internal.xsltc.trax.TransformerFactoryImpl()
11-May-2021 21:56:36 WARNING: Please consider reporting this to the maintainers of org.springframework.xml.transform.TransformerFactoryUtils
11-May-2021 21:56:36 WARNING: Use --illegal-access=warn to enable warnings of further illegal reflective access operations
11-May-2021 21:56:36 WARNING: All illegal access operations will be denied in a future release
11-May-2021 21:56:47
11-May-2021 21:56:47 > Task :spring-integration-ws:test
11-May-2021 21:56:48 WARNING: An illegal reflective access operation has occurred
11-May-2021 21:56:48 WARNING: Illegal reflective access by org.springframework.util.ReflectionUtils (file:/opt/users/bamboo/.gradle/caches/modules-2/files-2.1/org.springframework/spring-core/5.3.7-SNAPSHOT/c5b4e78a93fb7d9706c0cffe7354230c5b4372df/spring-core-5.3.7-SNAPSHOT.jar) to constructor java.lang.invoke.MethodHandles$Lookup(java.lang.Class)
11-May-2021 21:56:48 WARNING: Please consider reporting this to the maintainers of org.springframework.util.ReflectionUtils
11-May-2021 21:56:48 WARNING: Use --illegal-access=warn to enable warnings of further illegal reflective access operations
11-May-2021 21:56:48 WARNING: All illegal access operations will be denied in a future release
11-May-2021 21:56:49
11-May-2021 21:56:49 > Task :spring-integration-ws:check
11-May-2021 21:56:49 > Task :spring-integration-ws:build
11-May-2021 21:56:50 > Task :spring-integration-xmpp:compileKotlin
11-May-2021 21:56:50 > Task :spring-integration-xml:check
11-May-2021 21:56:50 > Task :spring-integration-xml:build
11-May-2021 21:56:50 > Task :spring-integration-xmpp:compileJava
11-May-2021 21:56:50 > Task :spring-integration-xmpp:classes
11-May-2021 21:56:50 > Task :spring-integration-xmpp:inspectClassesForKotlinIC
11-May-2021 21:56:50 > Task :spring-integration-xmpp:jar
11-May-2021 21:56:50 > Task :spring-integration-zeromq:compileKotlin
11-May-2021 21:56:51 > Task :spring-integration-zeromq:compileJava
11-May-2021 21:56:51 > Task :spring-integration-zeromq:classes
11-May-2021 21:56:51 > Task :spring-integration-zeromq:inspectClassesForKotlinIC
11-May-2021 21:56:51 > Task :spring-integration-zeromq:jar
11-May-2021 21:56:56 > Task :spring-integration-xmpp:javadoc
11-May-2021 21:56:56 > Task :spring-integration-xmpp:javadocJar
11-May-2021 21:56:56 > Task :spring-integration-xmpp:assemble
11-May-2021 21:56:56 > Task :spring-integration-xmpp:checkstyleMain
11-May-2021 21:56:57 > Task :spring-integration-zeromq:javadoc
11-May-2021 21:56:57 > Task :spring-integration-zeromq:javadocJar
11-May-2021 21:56:57 > Task :spring-integration-zeromq:assemble
11-May-2021 21:56:57 > Task :spring-integration-zeromq:checkstyleMain
11-May-2021 21:56:57 > Task :spring-integration-zeromq:compileTestKotlin
11-May-2021 21:56:58 > Task :spring-integration-zeromq:compileTestJava
11-May-2021 21:56:58 > Task :spring-integration-zeromq:testClasses
11-May-2021 21:56:58 > Task :spring-integration-zeromq:checkstyleTest
11-May-2021 21:56:59 > Task :spring-integration-xmpp:compileTestKotlin
11-May-2021 21:57:01 > Task :spring-integration-xmpp:compileTestJava
11-May-2021 21:57:01 > Task :spring-integration-xmpp:testClasses
11-May-2021 21:57:02 > Task :spring-integration-xmpp:checkstyleTest
11-May-2021 21:57:20 > Task :spring-integration-xmpp:test
11-May-2021 21:57:20 > Task :spring-integration-xmpp:check
11-May-2021 21:57:20 > Task :spring-integration-xmpp:build
11-May-2021 21:57:20 > Task :spring-integration-zookeeper:compileKotlin
11-May-2021 21:57:25 > Task :spring-integration-zookeeper:compileJava
11-May-2021 21:57:25 > Task :spring-integration-zookeeper:classes
11-May-2021 21:57:25 > Task :spring-integration-zookeeper:inspectClassesForKotlinIC
11-May-2021 21:57:25 > Task :spring-integration-zookeeper:jar
11-May-2021 21:57:28 > Task :spring-integration-zeromq:test
11-May-2021 21:57:28 > Task :spring-integration-zookeeper:javadoc
11-May-2021 21:57:28 > Task :spring-integration-zookeeper:javadocJar
11-May-2021 21:57:28 > Task :spring-integration-zookeeper:assemble
11-May-2021 21:57:28 > Task :spring-integration-zookeeper:checkstyleMain
11-May-2021 21:57:28 > Task :spring-integration-zeromq:check
11-May-2021 21:57:28 > Task :spring-integration-zeromq:build
11-May-2021 21:57:29 > Task :spring-integration-zookeeper:compileTestKotlin
11-May-2021 21:57:32 > Task :spring-integration-zookeeper:compileTestJava
11-May-2021 21:57:32 > Task :spring-integration-zookeeper:testClasses
11-May-2021 21:57:32 > Task :spring-integration-zookeeper:checkstyleTest
11-May-2021 21:57:59 > Task :spring-integration-zookeeper:test
11-May-2021 21:57:59 > Task :spring-integration-zookeeper:check
11-May-2021 21:57:59 > Task :spring-integration-zookeeper:build
11-May-2021 21:57:59 > Task :api
11-May-2021 21:57:59 > Task :spring-integration-amqp:generateMetadataFileForMavenJavaPublication
11-May-2021 21:57:59 > Task :spring-integration-amqp:artifactoryPublish
11-May-2021 21:57:59 > Task :spring-integration-event:generateMetadataFileForMavenJavaPublication
11-May-2021 21:57:59 > Task :spring-integration-event:artifactoryPublish
11-May-2021 21:57:59 > Task :spring-integration-feed:generateMetadataFileForMavenJavaPublication
11-May-2021 21:57:59 > Task :spring-integration-feed:artifactoryPublish
11-May-2021 21:57:59 > Task :spring-integration-file:generateMetadataFileForMavenJavaPublication
11-May-2021 21:57:59 > Task :spring-integration-file:artifactoryPublish
11-May-2021 21:57:59 > Task :spring-integration-ftp:generateMetadataFileForMavenJavaPublication
11-May-2021 21:57:59 > Task :spring-integration-ftp:artifactoryPublish
11-May-2021 21:57:59 > Task :spring-integration-gemfire:generateMetadataFileForMavenJavaPublication
11-May-2021 21:57:59 > Task :spring-integration-gemfire:artifactoryPublish
11-May-2021 21:57:59 > Task :spring-integration-groovy:generateMetadataFileForMavenJavaPublication
11-May-2021 21:57:59 > Task :spring-integration-groovy:artifactoryPublish
11-May-2021 21:57:59 > Task :spring-integration-http:generateMetadataFileForMavenJavaPublication
11-May-2021 21:57:59 > Task :spring-integration-http:artifactoryPublish
11-May-2021 21:57:59 > Task :spring-integration-ip:generateMetadataFileForMavenJavaPublication
11-May-2021 21:57:59 > Task :spring-integration-ip:artifactoryPublish
11-May-2021 21:57:59 > Task :spring-integration-jdbc:generateMetadataFileForMavenJavaPublication
11-May-2021 21:57:59 > Task :spring-integration-jdbc:artifactoryPublish
11-May-2021 21:57:59 > Task :spring-integration-jms:generateMetadataFileForMavenJavaPublication
11-May-2021 21:57:59 > Task :spring-integration-jms:artifactoryPublish
11-May-2021 21:57:59 > Task :spring-integration-jmx:generateMetadataFileForMavenJavaPublication
11-May-2021 21:57:59 > Task :spring-integration-jmx:artifactoryPublish
11-May-2021 21:57:59 > Task :spring-integration-jpa:generateMetadataFileForMavenJavaPublication
11-May-2021 21:57:59 > Task :spring-integration-jpa:artifactoryPublish
11-May-2021 21:57:59 > Task :spring-integration-kafka:generateMetadataFileForMavenJavaPublication
11-May-2021 21:57:59 > Task :spring-integration-kafka:artifactoryPublish
11-May-2021 21:57:59 > Task :spring-integration-mail:generateMetadataFileForMavenJavaPublication
11-May-2021 21:57:59 > Task :spring-integration-mail:artifactoryPublish
11-May-2021 21:57:59 > Task :spring-integration-mongodb:generateMetadataFileForMavenJavaPublication
11-May-2021 21:57:59 > Task :spring-integration-mongodb:artifactoryPublish
11-May-2021 21:57:59 > Task :spring-integration-mqtt:generateMetadataFileForMavenJavaPublication
11-May-2021 21:57:59 > Task :spring-integration-mqtt:artifactoryPublish
11-May-2021 21:57:59 > Task :spring-integration-r2dbc:generateMetadataFileForMavenJavaPublication
11-May-2021 21:57:59 > Task :spring-integration-r2dbc:artifactoryPublish
11-May-2021 21:57:59 > Task :spring-integration-rmi:generateMetadataFileForMavenJavaPublication
11-May-2021 21:57:59 > Task :spring-integration-rmi:artifactoryPublish
11-May-2021 21:58:00 > Task :spring-integration-rsocket:generateMetadataFileForMavenJavaPublication
11-May-2021 21:58:00 > Task :spring-integration-rsocket:artifactoryPublish
11-May-2021 21:58:00 > Task :spring-integration-scripting:generateMetadataFileForMavenJavaPublication
11-May-2021 21:58:00 > Task :spring-integration-scripting:artifactoryPublish
11-May-2021 21:58:00 > Task :spring-integration-security:generateMetadataFileForMavenJavaPublication
11-May-2021 21:58:00 > Task :spring-integration-security:artifactoryPublish
11-May-2021 21:58:00 > Task :spring-integration-sftp:generateMetadataFileForMavenJavaPublication
11-May-2021 21:58:00 > Task :spring-integration-sftp:artifactoryPublish
11-May-2021 21:58:00 > Task :spring-integration-stomp:generateMetadataFileForMavenJavaPublication
11-May-2021 21:58:00 > Task :spring-integration-stomp:artifactoryPublish
11-May-2021 21:58:00 > Task :spring-integration-stream:generateMetadataFileForMavenJavaPublication
11-May-2021 21:58:00 > Task :spring-integration-stream:artifactoryPublish
11-May-2021 21:58:00 > Task :spring-integration-syslog:generateMetadataFileForMavenJavaPublication
11-May-2021 21:58:00 > Task :spring-integration-syslog:artifactoryPublish
11-May-2021 21:58:00 > Task :spring-integration-test:generateMetadataFileForMavenJavaPublication
11-May-2021 21:58:00 > Task :spring-integration-test:artifactoryPublish
11-May-2021 21:58:00 > Task :spring-integration-webflux:generateMetadataFileForMavenJavaPublication
11-May-2021 21:58:00 > Task :spring-integration-webflux:artifactoryPublish
11-May-2021 21:58:00 > Task :spring-integration-websocket:generateMetadataFileForMavenJavaPublication
11-May-2021 21:58:00 > Task :spring-integration-websocket:artifactoryPublish
11-May-2021 21:58:00 > Task :spring-integration-ws:generateMetadataFileForMavenJavaPublication
11-May-2021 21:58:00 > Task :spring-integration-ws:artifactoryPublish
11-May-2021 21:58:00 > Task :spring-integration-xml:generateMetadataFileForMavenJavaPublication
11-May-2021 21:58:00 > Task :spring-integration-xml:artifactoryPublish
11-May-2021 21:58:00 > Task :spring-integration-xmpp:generateMetadataFileForMavenJavaPublication
11-May-2021 21:58:00 > Task :spring-integration-xmpp:artifactoryPublish
11-May-2021 21:58:00 > Task :spring-integration-zeromq:generateMetadataFileForMavenJavaPublication
11-May-2021 21:58:00 > Task :spring-integration-zeromq:artifactoryPublish
11-May-2021 21:58:00 > Task :spring-integration-zookeeper:generateMetadataFileForMavenJavaPublication
11-May-2021 21:58:00 > Task :spring-integration-zookeeper:artifactoryPublish
11-May-2021 21:58:02 > Task :spring-integration-amqp:extractModuleInfo
11-May-2021 21:58:03 > Task :spring-integration-event:extractModuleInfo
11-May-2021 21:58:04 > Task :spring-integration-feed:extractModuleInfo
11-May-2021 21:58:08 > Task :spring-integration-file:extractModuleInfo
11-May-2021 21:58:09 > Task :spring-integration-ftp:extractModuleInfo
11-May-2021 21:58:12 > Task :spring-integration-gemfire:extractModuleInfo
11-May-2021 21:58:14 > Task :spring-integration-groovy:extractModuleInfo
11-May-2021 21:58:15 > Task :spring-integration-http:extractModuleInfo
11-May-2021 21:58:17 > Task :spring-integration-ip:extractModuleInfo
11-May-2021 21:58:18 > Task :spring-integration-jdbc:extractModuleInfo
11-May-2021 21:58:20 > Task :spring-integration-jms:extractModuleInfo
11-May-2021 21:58:21 > Task :spring-integration-jmx:extractModuleInfo
11-May-2021 21:58:21
11-May-2021 21:58:21 > Task :dokka
11-May-2021 21:58:21 Could not find target with name:  in Kotlin Gradle Plugin
11-May-2021 21:58:21 Could not find target with name:  in Kotlin Gradle Plugin
11-May-2021 21:58:22
11-May-2021 21:58:22 > Task :spring-integration-jpa:extractModuleInfo
11-May-2021 21:58:24 > Task :spring-integration-kafka:extractModuleInfo
11-May-2021 21:58:25 > Task :spring-integration-mail:extractModuleInfo
11-May-2021 21:58:26 > Task :spring-integration-mongodb:extractModuleInfo
11-May-2021 21:58:28 > Task :spring-integration-mqtt:extractModuleInfo
11-May-2021 21:58:29 > Task :spring-integration-r2dbc:extractModuleInfo
11-May-2021 21:58:30 > Task :spring-integration-rmi:extractModuleInfo
11-May-2021 21:58:31 > Task :spring-integration-rsocket:extractModuleInfo
11-May-2021 21:58:33
11-May-2021 21:58:33 > Task :dokka
11-May-2021 21:58:33 Could not find target with name:  in Kotlin Gradle Plugin
11-May-2021 21:58:33
11-May-2021 21:58:33 > Task :spring-integration-scripting:extractModuleInfo
11-May-2021 21:58:35 > Task :spring-integration-security:extractModuleInfo
11-May-2021 21:58:35 error: source file or directory not found: /opt/bamboo-home/xml-data/build-dir/INT-MAIN-JOB1/spring-integration-amqp/src/main/kotlin
11-May-2021 21:58:35 error: source file or directory not found: /opt/bamboo-home/xml-data/build-dir/INT-MAIN-JOB1/spring-integration-event/src/main/kotlin
11-May-2021 21:58:35 error: source file or directory not found: /opt/bamboo-home/xml-data/build-dir/INT-MAIN-JOB1/spring-integration-feed/src/main/kotlin
11-May-2021 21:58:35 error: source file or directory not found: /opt/bamboo-home/xml-data/build-dir/INT-MAIN-JOB1/spring-integration-file/src/main/kotlin
11-May-2021 21:58:35 error: source file or directory not found: /opt/bamboo-home/xml-data/build-dir/INT-MAIN-JOB1/spring-integration-ftp/src/main/kotlin
11-May-2021 21:58:35 error: source file or directory not found: /opt/bamboo-home/xml-data/build-dir/INT-MAIN-JOB1/spring-integration-gemfire/src/main/kotlin
11-May-2021 21:58:35 error: source file or directory not found: /opt/bamboo-home/xml-data/build-dir/INT-MAIN-JOB1/spring-integration-groovy/src/main/kotlin
11-May-2021 21:58:35
11-May-2021 21:58:35 error: source file or directory not found: /opt/bamboo-home/xml-data/build-dir/INT-MAIN-JOB1/spring-integration-http/src/main/kotlin
11-May-2021 21:58:35 > Task :dokka
11-May-2021 21:58:35 error: source file or directory not found: /opt/bamboo-home/xml-data/build-dir/INT-MAIN-JOB1/spring-integration-ip/src/main/kotlin
11-May-2021 21:58:35 error: source file or directory not found: /opt/bamboo-home/xml-data/build-dir/INT-MAIN-JOB1/spring-integration-jdbc/src/main/kotlin
11-May-2021 21:58:35 error: source file or directory not found: /opt/bamboo-home/xml-data/build-dir/INT-MAIN-JOB1/spring-integration-jms/src/main/kotlin
11-May-2021 21:58:35 error: source file or directory not found: /opt/bamboo-home/xml-data/build-dir/INT-MAIN-JOB1/spring-integration-jmx/src/main/kotlin
11-May-2021 21:58:35 error: source file or directory not found: /opt/bamboo-home/xml-data/build-dir/INT-MAIN-JOB1/spring-integration-jpa/src/main/kotlin
11-May-2021 21:58:35 error: source file or directory not found: /opt/bamboo-home/xml-data/build-dir/INT-MAIN-JOB1/spring-integration-kafka/src/main/kotlin
11-May-2021 21:58:35 error: source file or directory not found: /opt/bamboo-home/xml-data/build-dir/INT-MAIN-JOB1/spring-integration-mail/src/main/kotlin
11-May-2021 21:58:35 error: source file or directory not found: /opt/bamboo-home/xml-data/build-dir/INT-MAIN-JOB1/spring-integration-mongodb/src/main/kotlin
11-May-2021 21:58:35 error: source file or directory not found: /opt/bamboo-home/xml-data/build-dir/INT-MAIN-JOB1/spring-integration-mqtt/src/main/kotlin
11-May-2021 21:58:35 error: source file or directory not found: /opt/bamboo-home/xml-data/build-dir/INT-MAIN-JOB1/spring-integration-r2dbc/src/main/kotlin
11-May-2021 21:58:35 error: source file or directory not found: /opt/bamboo-home/xml-data/build-dir/INT-MAIN-JOB1/spring-integration-redis/src/main/kotlin
11-May-2021 21:58:35 error: source file or directory not found: /opt/bamboo-home/xml-data/build-dir/INT-MAIN-JOB1/spring-integration-rmi/src/main/kotlin
11-May-2021 21:58:35 error: source file or directory not found: /opt/bamboo-home/xml-data/build-dir/INT-MAIN-JOB1/spring-integration-rsocket/src/main/kotlin
11-May-2021 21:58:35 error: source file or directory not found: /opt/bamboo-home/xml-data/build-dir/INT-MAIN-JOB1/spring-integration-scripting/src/main/kotlin
11-May-2021 21:58:35 error: source file or directory not found: /opt/bamboo-home/xml-data/build-dir/INT-MAIN-JOB1/spring-integration-security/src/main/kotlin
11-May-2021 21:58:35 error: source file or directory not found: /opt/bamboo-home/xml-data/build-dir/INT-MAIN-JOB1/spring-integration-sftp/src/main/kotlin
11-May-2021 21:58:35 error: source file or directory not found: /opt/bamboo-home/xml-data/build-dir/INT-MAIN-JOB1/spring-integration-stomp/src/main/kotlin
11-May-2021 21:58:35 error: source file or directory not found: /opt/bamboo-home/xml-data/build-dir/INT-MAIN-JOB1/spring-integration-stream/src/main/kotlin
11-May-2021 21:58:35 error: source file or directory not found: /opt/bamboo-home/xml-data/build-dir/INT-MAIN-JOB1/spring-integration-syslog/src/main/kotlin
11-May-2021 21:58:35 error: source file or directory not found: /opt/bamboo-home/xml-data/build-dir/INT-MAIN-JOB1/spring-integration-test/src/main/kotlin
11-May-2021 21:58:35 error: source file or directory not found: /opt/bamboo-home/xml-data/build-dir/INT-MAIN-JOB1/spring-integration-test-support/src/main/kotlin
11-May-2021 21:58:35 error: source file or directory not found: /opt/bamboo-home/xml-data/build-dir/INT-MAIN-JOB1/spring-integration-webflux/src/main/kotlin
11-May-2021 21:58:35 error: source file or directory not found: /opt/bamboo-home/xml-data/build-dir/INT-MAIN-JOB1/spring-integration-websocket/src/main/kotlin
11-May-2021 21:58:35 error: source file or directory not found: /opt/bamboo-home/xml-data/build-dir/INT-MAIN-JOB1/spring-integration-ws/src/main/kotlin
11-May-2021 21:58:35 error: source file or directory not found: /opt/bamboo-home/xml-data/build-dir/INT-MAIN-JOB1/spring-integration-xml/src/main/kotlin
11-May-2021 21:58:35 error: source file or directory not found: /opt/bamboo-home/xml-data/build-dir/INT-MAIN-JOB1/spring-integration-xmpp/src/main/kotlin
11-May-2021 21:58:35 error: source file or directory not found: /opt/bamboo-home/xml-data/build-dir/INT-MAIN-JOB1/spring-integration-zeromq/src/main/kotlin
11-May-2021 21:58:35 error: source file or directory not found: /opt/bamboo-home/xml-data/build-dir/INT-MAIN-JOB1/spring-integration-zookeeper/src/main/kotlin
11-May-2021 21:58:35 logging: loading modules: [java.se, jdk.accessibility, jdk.attach, jdk.compiler, jdk.dynalink, jdk.httpserver, jdk.incubator.foreign, jdk.jartool, jdk.javadoc, jdk.jconsole, jdk.jdi, jdk.jfr, jdk.jshell, jdk.jsobject, jdk.management, jdk.management.jfr, jdk.net, jdk.nio.mapmode, jdk.scripting.nashorn, jdk.sctp, jdk.security.auth, jdk.security.jgss, jdk.unsupported, jdk.unsupported.desktop, jdk.xml.dom, java.base, java.compiler, java.datatransfer, java.desktop, java.xml, java.instrument, java.logging, java.management, java.management.rmi, java.rmi, java.naming, java.net.http, java.prefs, java.scripting, java.security.jgss, java.security.sasl, java.sql, java.transaction.xa, java.sql.rowset, java.xml.crypto, jdk.internal.jvmstat, jdk.management.agent, jdk.jdwp.agent, jdk.internal.ed, jdk.internal.le, jdk.internal.opt]
11-May-2021 21:58:36
11-May-2021 21:58:36 > Task :spring-integration-sftp:extractModuleInfo
11-May-2021 21:58:37 > Task :spring-integration-stomp:extractModuleInfo
11-May-2021 21:58:39 > Task :spring-integration-stream:extractModuleInfo
11-May-2021 21:58:41 > Task :spring-integration-syslog:extractModuleInfo
11-May-2021 21:58:42 > Task :spring-integration-test:extractModuleInfo
11-May-2021 21:58:44 > Task :spring-integration-webflux:extractModuleInfo
11-May-2021 21:58:46 > Task :spring-integration-websocket:extractModuleInfo
11-May-2021 21:58:48 > Task :spring-integration-ws:extractModuleInfo
11-May-2021 21:58:50 > Task :spring-integration-xml:extractModuleInfo
11-May-2021 21:58:51 > Task :spring-integration-xmpp:extractModuleInfo
11-May-2021 21:58:53 > Task :spring-integration-zeromq:extractModuleInfo
11-May-2021 21:58:54 > Task :spring-integration-zookeeper:extractModuleInfo
11-May-2021 21:59:00
11-May-2021 21:59:00 WARNING: An illegal reflective access operation has occurred
11-May-2021 21:59:00 > Task :asciidoctor
11-May-2021 21:59:00 WARNING: Illegal reflective access by org.codehaus.groovy.reflection.CachedClass (file:/opt/users/bamboo/.gradle/wrapper/dists/gradle-6.8.2-bin/5nlkemqlnno2amj7d1mfn69bt/gradle-6.8.2/lib/groovy-all-1.3-2.5.12.jar) to method java.lang.Object.finalize()
11-May-2021 21:59:00 WARNING: Please consider reporting this to the maintainers of org.codehaus.groovy.reflection.CachedClass
11-May-2021 21:59:00 WARNING: Use --illegal-access=warn to enable warnings of further illegal reflective access operations
11-May-2021 21:59:00 WARNING: All illegal access operations will be denied in a future release
11-May-2021 21:59:12 May 11, 2021 9:59:12 PM uri:classloader:/gems/asciidoctor-2.0.12/lib/asciidoctor/parser.rb next_block
11-May-2021 21:59:12 WARNING: channel-adapter.adoc: line 79: unterminated listing block
11-May-2021 21:59:12 May 11, 2021 9:59:12 PM uri:classloader:/gems/asciidoctor-2.0.12/lib/asciidoctor/parser.rb next_block
11-May-2021 21:59:12 WARNING: channel-adapter.adoc: line 178: unterminated listing block
11-May-2021 21:59:12 May 11, 2021 9:59:12 PM uri:classloader:/gems/asciidoctor-2.0.12/lib/asciidoctor/parser.rb next_block
11-May-2021 21:59:12 WARNING: channel-adapter.adoc: line 205: unterminated listing block
11-May-2021 21:59:16 May 11, 2021 9:59:16 PM uri:classloader:/gems/asciidoctor-2.0.12/lib/asciidoctor/parser.rb next_block
11-May-2021 21:59:16 WARNING: channel-adapter.adoc: line 79: unterminated listing block
11-May-2021 21:59:16 May 11, 2021 9:59:16 PM uri:classloader:/gems/asciidoctor-2.0.12/lib/asciidoctor/parser.rb next_block
11-May-2021 21:59:16 WARNING: channel-adapter.adoc: line 178: unterminated listing block
11-May-2021 21:59:16 May 11, 2021 9:59:16 PM uri:classloader:/gems/asciidoctor-2.0.12/lib/asciidoctor/parser.rb next_block
11-May-2021 21:59:17 WARNING: channel-adapter.adoc: line 205: unterminated listing block
11-May-2021 21:59:23 May 11, 2021 9:59:23 PM uri:classloader:/gems/asciidoctor-2.0.12/lib/asciidoctor/parser.rb next_block
11-May-2021 21:59:23 WARNING: channel-adapter.adoc: line 79: unterminated listing block
11-May-2021 21:59:23 May 11, 2021 9:59:23 PM uri:classloader:/gems/asciidoctor-2.0.12/lib/asciidoctor/parser.rb next_block
11-May-2021 21:59:23 WARNING: channel-adapter.adoc: line 178: unterminated listing block
11-May-2021 21:59:23 May 11, 2021 9:59:23 PM uri:classloader:/gems/asciidoctor-2.0.12/lib/asciidoctor/parser.rb next_block
11-May-2021 21:59:23 WARNING: channel-adapter.adoc: line 205: unterminated listing block
11-May-2021 21:59:24
11-May-2021 21:59:24 > Task :reference
11-May-2021 21:59:27 > Task :docsZip
11-May-2021 21:59:27 > Task :schemaZip
11-May-2021 21:59:33 > Task :distZip
11-May-2021 21:59:33 > Task :generatePomFileForMavenJavaPublication
11-May-2021 22:01:30
11-May-2021 22:01:30 > Task :spring-integration-core:test
11-May-2021 22:01:30
11-May-2021 22:01:30 DelayHandlerTests > errorFlowAndRetries FAILED
11-May-2021 22:01:30     org.opentest4j.AssertionFailedError at DelayHandlerTests.java:170
11-May-2021 22:12:02 *** java.lang.instrument ASSERTION FAILED ***: "!errorOutstanding" with message can't create name string at ./src/java.instrument/share/native/libinstrument/JPLISAgent.c line: 827
11-May-2021 22:32:03 Force Stop build feature is enabled for current plan. Either Bamboo has detected the build has hung or it has been manually stopped.
11-May-2021 22:32:03 Attempting to generate stack trace and terminate spawned sub-processes of process id: 7329
11-May-2021 22:32:03 Found related process: pid: 2335 ppid: 7329 pgid: 2229 %cpu: 0.2 %mem: 0.4 cmd: /opt/jdk-14//bin/java
11-May-2021 22:32:03 Found related process: pid: 2387 ppid: 2335 pgid: 2387 %cpu: 17.8 %mem: 9.6 cmd: /opt/jdk-14.0.2+12/bin/java
11-May-2021 22:32:03 Found related process: pid: 3877 ppid: 2387 pgid: 2387 %cpu: 132 %mem: 11.8 cmd: /opt/jdk-14.0.2+12/bin/java
11-May-2021 22:32:03 Found related process: pid: 17978 ppid: 2387 pgid: 2387 %cpu: 1.2 %mem: 1.9 cmd: /opt/jdk-14.0.2+12/bin/java
11-May-2021 22:32:03 Found related process: pid: 2733 ppid: 2387 pgid: 2387 %cpu: 2.6 %mem: 2.0 cmd: /opt/jdk-14.0.2+12/bin/java
11-May-2021 22:32:03 getStackTraceAndKillRelatedProcesses for 5 processes
11-May-2021 22:32:03 Executing kill -3 2733
11-May-2021 22:32:03 Executing kill -3 17978
11-May-2021 22:32:03 Executing kill -3 3877
11-May-2021 22:32:04 Executing kill -3 2387
11-May-2021 22:32:04 Executing kill -3 2335
11-May-2021 22:32:04 2021-05-11 22:32:04
11-May-2021 22:32:04 Full thread dump OpenJDK 64-Bit Server VM (14.0.2+12 mixed mode, sharing):
11-May-2021 22:32:04
11-May-2021 22:32:04 Threads class SMR info:
11-May-2021 22:32:04 _java_thread_list=0x00007f072c891250, length=14, elements={
11-May-2021 22:32:04 0x00007f072c029800, 0x00007f072c0b9800, 0x00007f072c0bb800, 0x00007f072c0c1800,
11-May-2021 22:32:04 0x00007f072c0c3800, 0x00007f072c0c5800, 0x00007f072c0c7000, 0x00007f072c0c9800,
11-May-2021 22:32:04 0x00007f072c102000, 0x00007f072c107000, 0x00007f072c744000, 0x00007f06b400a000,
11-May-2021 22:32:04 0x00007f072c890000, 0x00007f072c894800
11-May-2021 22:32:04 }
11-May-2021 22:32:04
11-May-2021 22:32:04 "main" #1 prio=5 os_prio=0 cpu=1659.59ms elapsed=3158.76s tid=0x00007f072c029800 nid=0x93a runnable  [0x00007f0733579000]
11-May-2021 22:32:04    java.lang.Thread.State: RUNNABLE
11-May-2021 22:32:04         at sun.nio.ch.EPoll.wait([email protected]/Native Method)
11-May-2021 22:32:04         at sun.nio.ch.EPollSelectorImpl.doSelect([email protected]/EPollSelectorImpl.java:120)
11-May-2021 22:32:04         at sun.nio.ch.SelectorImpl.lockAndDoSelect([email protected]/SelectorImpl.java:129)
11-May-2021 22:32:04         - locked <0x00000000ff40aac8> (a sun.nio.ch.Util$2)
11-May-2021 22:32:04         - locked <0x00000000ff40a728> (a sun.nio.ch.EPollSelectorImpl)
11-May-2021 22:32:04         at sun.nio.ch.SelectorImpl.select([email protected]/SelectorImpl.java:146)
11-May-2021 22:32:04         at org.gradle.internal.remote.internal.inet.SocketConnection$SocketInputStream.read(SocketConnection.java:185)
11-May-2021 22:32:04         at com.esotericsoftware.kryo.io.Input.fill(Input.java:146)
11-May-2021 22:32:04         at com.esotericsoftware.kryo.io.Input.require(Input.java:178)
11-May-2021 22:32:04         at com.esotericsoftware.kryo.io.Input.readVarInt(Input.java:355)
11-May-2021 22:32:04         at com.esotericsoftware.kryo.io.Input.readInt(Input.java:350)
11-May-2021 22:32:04         at org.gradle.internal.serialize.kryo.KryoBackedDecoder.readSmallInt(KryoBackedDecoder.java:127)
11-May-2021 22:32:04         at org.gradle.internal.serialize.DefaultSerializerRegistry$TaggedTypeSerializer.read(DefaultSerializerRegistry.java:142)
11-May-2021 22:32:04         at org.gradle.internal.serialize.Serializers$StatefulSerializerAdapter$1.read(Serializers.java:36)
11-May-2021 22:32:04         at org.gradle.internal.remote.internal.inet.SocketConnection.receive(SocketConnection.java:81)
11-May-2021 22:32:04         at org.gradle.launcher.daemon.client.DaemonClientConnection.receive(DaemonClientConnection.java:77)
11-May-2021 22:32:04         at org.gradle.launcher.daemon.client.DaemonClientConnection.receive(DaemonClientConnection.java:35)
11-May-2021 22:32:04         at org.gradle.launcher.daemon.client.DaemonClient.monitorBuild(DaemonClient.java:215)
11-May-2021 22:32:04         at org.gradle.launcher.daemon.client.DaemonClient.executeBuild(DaemonClient.java:184)
11-May-2021 22:32:04         at org.gradle.launcher.daemon.client.SingleUseDaemonClient.execute(SingleUseDaemonClient.java:54)
11-May-2021 22:32:04         at org.gradle.launcher.daemon.client.SingleUseDaemonClient.execute(SingleUseDaemonClient.java:37)
11-May-2021 22:32:04         at org.gradle.launcher.cli.RunBuildAction.run(RunBuildAction.java:57)
11-May-2021 22:32:04         at org.gradle.internal.Actions$RunnableActionAdapter.execute(Actions.java:212)
11-May-2021 22:32:04         at org.gradle.launcher.cli.DefaultCommandLineActionFactory$ParseAndBuildAction.execute(DefaultCommandLineActionFactory.java:275)
11-May-2021 22:32:04         at org.gradle.launcher.cli.DefaultCommandLineActionFactory$ParseAndBuildAction.execute(DefaultCommandLineActionFactory.java:247)
11-May-2021 22:32:04         at org.gradle.launcher.cli.DebugLoggerWarningAction.execute(DebugLoggerWarningAction.java:82)
11-May-2021 22:32:04         at org.gradle.launcher.cli.DebugLoggerWarningAction.execute(DebugLoggerWarningAction.java:30)
11-May-2021 22:32:04         at org.gradle.launcher.cli.WelcomeMessageAction.execute(WelcomeMessageAction.java:92)
11-May-2021 22:32:04         at org.gradle.launcher.cli.WelcomeMessageAction.execute(WelcomeMessageAction.java:38)
11-May-2021 22:32:04         at org.gradle.launcher.cli.NativeServicesInitializingAction.execute(NativeServicesInitializingAction.java:44)
11-May-2021 22:32:04         at org.gradle.launcher.cli.NativeServicesInitializingAction.execute(NativeServicesInitializingAction.java:26)
11-May-2021 22:32:04         at org.gradle.launcher.cli.ExceptionReportingAction.execute(ExceptionReportingAction.java:41)
11-May-2021 22:32:04         at org.gradle.launcher.cli.ExceptionReportingAction.execute(ExceptionReportingAction.java:26)
11-May-2021 22:32:04         at org.gradle.launcher.cli.DefaultCommandLineActionFactory$WithLogging.execute(DefaultCommandLineActionFactory.java:240)
11-May-2021 22:32:04         at org.gradle.launcher.Main.doAction(Main.java:35)
11-May-2021 22:32:04         at org.gradle.launcher.bootstrap.EntryPoint.run(EntryPoint.java:50)
11-May-2021 22:32:04         at jdk.internal.reflect.NativeMethodAccessorImpl.invoke0([email protected]/Native Method)
11-May-2021 22:32:04         at jdk.internal.reflect.NativeMethodAccessorImpl.invoke([email protected]/NativeMethodAccessorImpl.java:62)
11-May-2021 22:32:04         at jdk.internal.reflect.DelegatingMethodAccessorImpl.invoke([email protected]/DelegatingMethodAccessorImpl.java:43)
11-May-2021 22:32:04         at java.lang.reflect.Method.invoke([email protected]/Method.java:564)
11-May-2021 22:32:04         at org.gradle.launcher.bootstrap.ProcessBootstrap.runNoExit(ProcessBootstrap.java:60)
11-May-2021 22:32:04         at org.gradle.launcher.bootstrap.ProcessBootstrap.run(ProcessBootstrap.java:37)
11-May-2021 22:32:04         at org.gradle.launcher.GradleMain.main(GradleMain.java:31)
11-May-2021 22:32:04         at jdk.internal.reflect.NativeMethodAccessorImpl.invoke0([email protected]/Native Method)
11-May-2021 22:32:04         at jdk.internal.reflect.NativeMethodAccessorImpl.invoke([email protected]/NativeMethodAccessorImpl.java:62)
11-May-2021 22:32:04         at jdk.internal.reflect.DelegatingMethodAccessorImpl.invoke([email protected]/DelegatingMethodAccessorImpl.java:43)
11-May-2021 22:32:04         at java.lang.reflect.Method.invoke([email protected]/Method.java:564)
11-May-2021 22:32:04         at org.gradle.wrapper.BootstrapMainStarter.start(BootstrapMainStarter.java:35)
11-May-2021 22:32:04         at org.gradle.wrapper.WrapperExecutor.execute(WrapperExecutor.java:108)
11-May-2021 22:32:04         at org.gradle.wrapper.GradleWrapperMain.main(GradleWrapperMain.java:63)
11-May-2021 22:32:04
11-May-2021 22:32:04 "Reference Handler" #2 daemon prio=10 os_prio=0 cpu=0.37ms elapsed=3158.63s tid=0x00007f072c0b9800 nid=0x942 waiting on condition  [0x00007f06fbe7b000]
11-May-2021 22:32:04    java.lang.Thread.State: RUNNABLE
11-May-2021 22:32:04         at java.lang.ref.Reference.waitForReferencePendingList([email protected]/Native Method)
11-May-2021 22:32:04         at java.lang.ref.Reference.processPendingReferences([email protected]/Reference.java:241)
11-May-2021 22:32:04         at java.lang.ref.Reference$ReferenceHandler.run([email protected]/Reference.java:213)
11-May-2021 22:32:04
11-May-2021 22:32:04 "Finalizer" #3 daemon prio=8 os_prio=0 cpu=0.25ms elapsed=3158.63s tid=0x00007f072c0bb800 nid=0x943 in Object.wait()  [0x00007f06fbd7a000]
11-May-2021 22:32:04    java.lang.Thread.State: WAITING (on object monitor)
11-May-2021 22:32:04         at java.lang.Object.wait([email protected]/Native Method)
11-May-2021 22:32:04         - waiting on <0x00000000fc878178> (a java.lang.ref.ReferenceQueue$Lock)
11-May-2021 22:32:04         at java.lang.ref.ReferenceQueue.remove([email protected]/ReferenceQueue.java:155)
11-May-2021 22:32:04         - locked <0x00000000fc878178> (a java.lang.ref.ReferenceQueue$Lock)
11-May-2021 22:32:04         at java.lang.ref.ReferenceQueue.remove([email protected]/ReferenceQueue.java:176)
11-May-2021 22:32:04         at java.lang.ref.Finalizer$FinalizerThread.run([email protected]/Finalizer.java:170)
11-May-2021 22:32:04
11-May-2021 22:32:04 "Signal Dispatcher" #4 daemon prio=9 os_prio=0 cpu=0.12ms elapsed=3158.61s tid=0x00007f072c0c1800 nid=0x944 waiting on condition  [0x0000000000000000]
11-May-2021 22:32:04    java.lang.Thread.State: RUNNABLE
11-May-2021 22:32:04
11-May-2021 22:32:04 "Service Thread" #5 daemon prio=9 os_prio=0 cpu=1.53ms elapsed=3158.61s tid=0x00007f072c0c3800 nid=0x945 runnable  [0x0000000000000000]
11-May-2021 22:32:04    java.lang.Thread.State: RUNNABLE
11-May-2021 22:32:04
11-May-2021 22:32:04 "C2 CompilerThread0" #6 daemon prio=9 os_prio=0 cpu=1166.71ms elapsed=3158.61s tid=0x00007f072c0c5800 nid=0x946 waiting on condition  [0x0000000000000000]
11-May-2021 22:32:04    java.lang.Thread.State: RUNNABLE
11-May-2021 22:32:04    No compile task
11-May-2021 22:32:04
11-May-2021 22:32:04 "C1 CompilerThread0" #8 daemon prio=9 os_prio=0 cpu=556.09ms elapsed=3158.61s tid=0x00007f072c0c7000 nid=0x947 waiting on condition  [0x0000000000000000]
11-May-2021 22:32:04    java.lang.Thread.State: RUNNABLE
11-May-2021 22:32:04    No compile task
11-May-2021 22:32:04
11-May-2021 22:32:04 "Sweeper thread" #9 daemon prio=9 os_prio=0 cpu=37.75ms elapsed=3158.61s tid=0x00007f072c0c9800 nid=0x948 runnable  [0x0000000000000000]
11-May-2021 22:32:04    java.lang.Thread.State: RUNNABLE
11-May-2021 22:32:04
11-May-2021 22:32:04 "Notification Thread" #10 daemon prio=9 os_prio=0 cpu=0.08ms elapsed=3158.59s tid=0x00007f072c102000 nid=0x949 runnable  [0x0000000000000000]
11-May-2021 22:32:04    java.lang.Thread.State: RUNNABLE
11-May-2021 22:32:04
11-May-2021 22:32:04 "Common-Cleaner" #11 daemon prio=8 os_prio=0 cpu=3.32ms elapsed=3158.58s tid=0x00007f072c107000 nid=0x94b in Object.wait()  [0x00007f06fb293000]
11-May-2021 22:32:04    java.lang.Thread.State: TIMED_WAITING (on object monitor)
11-May-2021 22:32:04         at java.lang.Object.wait([email protected]/Native Method)
11-May-2021 22:32:04         - waiting on <0x00000000fc880058> (a java.lang.ref.ReferenceQueue$Lock)
11-May-2021 22:32:04         at java.lang.ref.ReferenceQueue.remove([email protected]/ReferenceQueue.java:155)
11-May-2021 22:32:04         - locked <0x00000000fc880058> (a java.lang.ref.ReferenceQueue$Lock)
11-May-2021 22:32:04         at jdk.internal.ref.CleanerImpl.run([email protected]/CleanerImpl.java:148)
11-May-2021 22:32:04         at java.lang.Thread.run([email protected]/Thread.java:832)
11-May-2021 22:32:04         at jdk.internal.misc.InnocuousThread.run([email protected]/InnocuousThread.java:134)
11-May-2021 22:32:04
11-May-2021 22:32:04 "pool-1-thread-1" #13 prio=5 os_prio=0 cpu=1673.03ms elapsed=3157.81s tid=0x00007f072c744000 nid=0x94f waiting on condition  [0x00007f06fad6a000]
11-May-2021 22:32:04    java.lang.Thread.State: TIMED_WAITING (parking)
11-May-2021 22:32:04         at jdk.internal.misc.Unsafe.park([email protected]/Native Method)
11-May-2021 22:32:04         - parking to wait for  <0x00000000fed03b48> (a java.util.concurrent.locks.AbstractQueuedSynchronizer$ConditionObject)
11-May-2021 22:32:04         at java.util.concurrent.locks.LockSupport.parkNanos([email protected]/LockSupport.java:252)
11-May-2021 22:32:04         at java.util.concurrent.locks.AbstractQueuedSynchronizer$ConditionObject.awaitNanos([email protected]/AbstractQueuedSynchronizer.java:1661)
11-May-2021 22:32:04         at java.util.concurrent.ScheduledThreadPoolExecutor$DelayedWorkQueue.take([email protected]/ScheduledThreadPoolExecutor.java:1182)
11-May-2021 22:32:04         at java.util.concurrent.ScheduledThreadPoolExecutor$DelayedWorkQueue.take([email protected]/ScheduledThreadPoolExecutor.java:899)
11-May-2021 22:32:04         at java.util.concurrent.ThreadPoolExecutor.getTask([email protected]/ThreadPoolExecutor.java:1056)
11-May-2021 22:32:04         at java.util.concurrent.ThreadPoolExecutor.runWorker([email protected]/ThreadPoolExecutor.java:1116)
11-May-2021 22:32:04         at java.util.concurrent.ThreadPoolExecutor$Worker.run([email protected]/ThreadPoolExecutor.java:630)
11-May-2021 22:32:04         at java.lang.Thread.run([email protected]/Thread.java:832)
11-May-2021 22:32:04
11-May-2021 22:32:04 "process reaper" #15 daemon prio=10 os_prio=0 cpu=0.18ms elapsed=3157.45s tid=0x00007f06b400a000 nid=0x95b runnable  [0x00007f06f9418000]
11-May-2021 22:32:04    java.lang.Thread.State: RUNNABLE
11-May-2021 22:32:04         at java.lang.ProcessHandleImpl.waitForProcessExit0([email protected]/Native Method)
11-May-2021 22:32:04         at java.lang.ProcessHandleImpl$1.run([email protected]/ProcessHandleImpl.java:138)
11-May-2021 22:32:04         at java.util.concurrent.ThreadPoolExecutor.runWorker([email protected]/ThreadPoolExecutor.java:1130)
11-May-2021 22:32:04         at java.util.concurrent.ThreadPoolExecutor$Worker.run([email protected]/ThreadPoolExecutor.java:630)
11-May-2021 22:32:04         at java.lang.Thread.run([email protected]/Thread.java:832)
11-May-2021 22:32:04
11-May-2021 22:32:04 "DisconnectableInputStream source reader" #19 daemon prio=5 os_prio=0 cpu=0.10ms elapsed=3156.20s tid=0x00007f072c890000 nid=0x979 runnable  [0x00007f06f9519000]
11-May-2021 22:32:04    java.lang.Thread.State: RUNNABLE
11-May-2021 22:32:04         at java.io.FileInputStream.readBytes([email protected]/Native Method)
11-May-2021 22:32:04         at java.io.FileInputStream.read([email protected]/FileInputStream.java:272)
11-May-2021 22:32:04         at java.io.BufferedInputStream.read1([email protected]/BufferedInputStream.java:282)
11-May-2021 22:32:04         at java.io.BufferedInputStream.read([email protected]/BufferedInputStream.java:343)
11-May-2021 22:32:04         - locked <0x00000000fc843450> (a java.io.BufferedInputStream)
11-May-2021 22:32:04         at org.gradle.util.DisconnectableInputStream$1.run(DisconnectableInputStream.java:98)
11-May-2021 22:32:04         at java.lang.Thread.run([email protected]/Thread.java:832)
11-May-2021 22:32:04
11-May-2021 22:32:04 "Forward input" #20 prio=5 os_prio=0 cpu=0.10ms elapsed=3156.20s tid=0x00007f072c894800 nid=0x97a waiting on condition  [0x00007f06f93f6000]
11-May-2021 22:32:04    java.lang.Thread.State: WAITING (parking)
11-May-2021 22:32:04         at jdk.internal.misc.Unsafe.park([email protected]/Native Method)
11-May-2021 22:32:04         - parking to wait for  <0x00000000ff455708> (a java.util.concurrent.locks.AbstractQueuedSynchronizer$ConditionObject)
11-May-2021 22:32:04         at java.util.concurrent.locks.LockSupport.park([email protected]/LockSupport.java:341)
11-May-2021 22:32:04         at java.util.concurrent.locks.AbstractQueuedSynchronizer$ConditionNode.block([email protected]/AbstractQueuedSynchronizer.java:505)
11-May-2021 22:32:04         at java.util.concurrent.ForkJoinPool.managedBlock([email protected]/ForkJoinPool.java:3137)
11-May-2021 22:32:04         at java.util.concurrent.locks.AbstractQueuedSynchronizer$ConditionObject.await([email protected]/AbstractQueuedSynchronizer.java:1614)
11-May-2021 22:32:04         at org.gradle.util.DisconnectableInputStream.read(DisconnectableInputStream.java:140)
11-May-2021 22:32:04         at org.gradle.launcher.daemon.client.InputForwarder$1.run(InputForwarder.java:78)
11-May-2021 22:32:04         at org.gradle.internal.concurrent.ExecutorPolicy$CatchAndRecordFailures.onExecute(ExecutorPolicy.java:64)
11-May-2021 22:32:04         at org.gradle.internal.concurrent.ManagedExecutorImpl$1.run(ManagedExecutorImpl.java:48)
11-May-2021 22:32:04         at java.util.concurrent.ThreadPoolExecutor.runWorker([email protected]/ThreadPoolExecutor.java:1130)
11-May-2021 22:32:04         at java.util.concurrent.ThreadPoolExecutor$Worker.run([email protected]/ThreadPoolExecutor.java:630)
11-May-2021 22:32:04         at org.gradle.internal.concurrent.ThreadFactoryImpl$ManagedThreadRunnable.run(ThreadFactoryImpl.java:56)
11-May-2021 22:32:04         at java.lang.Thread.run([email protected]/Thread.java:832)
11-May-2021 22:32:04
11-May-2021 22:32:04 "VM Thread" os_prio=0 cpu=206.90ms elapsed=3158.64s tid=0x00007f072c0b6800 nid=0x941 runnable 
11-May-2021 22:32:04
11-May-2021 22:32:04 "GC Thread#0" os_prio=0 cpu=43.61ms elapsed=3158.73s tid=0x00007f072c048800 nid=0x93b runnable 
11-May-2021 22:32:04
11-May-2021 22:32:04 "GC Thread#1" os_prio=0 cpu=52.97ms elapsed=3158.02s tid=0x00007f06f4001000 nid=0x94d runnable 
11-May-2021 22:32:04
11-May-2021 22:32:04 "GC Thread#2" os_prio=0 cpu=45.25ms elapsed=3157.61s tid=0x00007f06f4003800 nid=0x950 runnable 
11-May-2021 22:32:04
11-May-2021 22:32:04 "GC Thread#3" os_prio=0 cpu=39.46ms elapsed=3157.61s tid=0x00007f06f4004800 nid=0x951 runnable 
11-May-2021 22:32:04
11-May-2021 22:32:04 "G1 Main Marker" os_prio=0 cpu=0.10ms elapsed=3158.73s tid=0x00007f072c04b000 nid=0x93c runnable 
11-May-2021 22:32:04
11-May-2021 22:32:04 "G1 Conc#0" os_prio=0 cpu=0.06ms elapsed=3158.73s tid=0x00007f072c04c800 nid=0x93e runnable 
11-May-2021 22:32:04
11-May-2021 22:32:04 "G1 Refine#0" os_prio=0 cpu=3.50ms elapsed=3158.73s tid=0x00007f072c08f000 nid=0x93f runnable 
11-May-2021 22:32:04
11-May-2021 22:32:04 "G1 Young RemSet Sampling" os_prio=0 cpu=233.99ms elapsed=3158.73s tid=0x00007f072c090800 nid=0x940 runnable 
11-May-2021 22:32:04 "VM Periodic Task Thread" os_prio=0 cpu=825.17ms elapsed=3158.59s tid=0x00007f072c104000 nid=0x94a waiting on condition 
11-May-2021 22:32:04
11-May-2021 22:32:04 JNI global refs: 23, weak refs: 0
11-May-2021 22:32:04
11-May-2021 22:32:04 Heap
11-May-2021 22:32:04 garbage-first heap   total 65536K, used 29930K [0x00000000fc000000, 0x0000000100000000)
11-May-2021 22:32:04   region size 1024K, 22 young (22528K), 1 survivors (1024K)
11-May-2021 22:32:04 Metaspace       used 8656K, capacity 9326K, committed 9472K, reserved 1056768K
11-May-2021 22:32:04   class space    used 1134K, capacity 1265K, committed 1280K, reserved 1048576K
11-May-2021 22:32:04
11-May-2021 22:32:09 Killing: 2733
11-May-2021 22:32:09 Executing kill 2733
11-May-2021 22:32:09 Killing: 17978
11-May-2021 22:32:09 Executing kill 17978
11-May-2021 22:32:09 Killing: 3877
11-May-2021 22:32:09 Executing kill 3877
11-May-2021 22:32:09 Killing: 2387
11-May-2021 22:32:09 Executing kill 2387
11-May-2021 22:32:09 Killing: 2335
11-May-2021 22:32:09 Executing kill 2335
11-May-2021 22:32:09
11-May-2021 22:32:09 Failing task since return code of [./gradlew --refresh-dependencies --no-daemon clean build dist -DbuildInfoConfig.propertiesFile=/tmp/buildinfo6958524019470793372properties artifactoryPublish -Dartifactory.resolve.password=******** -Dartifactory.publish.password=********] was 143 while expected 0
11-May-2021 22:32:09 Parsing test results under /opt/bamboo-home/xml-data/build-dir/INT-MAIN-JOB1...
11-May-2021 22:32:10 Finished task 'Artifactory Gradle' with result: Failed
11-May-2021 22:32:10 Running post build plugin 'Docker Container Cleanup'
11-May-2021 22:32:10 Running post build plugin 'NCover Results Collector'
11-May-2021 22:32:10 Running post build plugin 'Artifactory Release Management Staging'
11-May-2021 22:32:10 Running post build plugin 'Artifactory Build Info Copier'
11-May-2021 22:32:10 Running post build plugin 'Artifactory Gradle Properties Info Copier'
11-May-2021 22:32:10 Running post build plugin 'Clover Results Collector'
11-May-2021 22:32:10 Running post build plugin 'npm Cache Cleanup'
11-May-2021 22:32:10 Running post build plugin 'Artifact Copier'
11-May-2021 22:32:10 Publishing an artifact: Test Results
11-May-2021 22:32:10 Finished publishing of artifact Non required job artifact: [Test Results], pattern: [*/build/reports/tests/**/*.*] in 258.1 ms
11-May-2021 22:32:11 Successfully removed working directory at '/opt/bamboo-home/xml-data/build-dir/INT-MAIN-JOB1'
11-May-2021 22:32:11 Finalising the build...
11-May-2021 22:32:11 Stopping timer.
11-May-2021 22:32:11 Build INT-MAIN-JOB1-34 completed.
11-May-2021 22:32:12 Running on server: post build plugin 'NCover Results Collector'
11-May-2021 22:32:12 Running on server: post build plugin 'Build Hanging Detection Configuration'
11-May-2021 22:32:12 Running on server: post build plugin 'Bamboo project link creator'
11-May-2021 22:32:12 Running on server: post build plugin 'Clover Delta Calculator'
11-May-2021 22:32:12 Running on server: post build plugin 'Maven Dependencies Postprocessor'
11-May-2021 22:32:12 All post build plugins have finished
11-May-2021 22:32:12 Generating build results summary...
11-May-2021 22:32:12 Saving build results to disk...
11-May-2021 22:32:12 Logging substituted variables...
11-May-2021 22:32:12 Indexing build results...
11-May-2021 22:32:12 Finished building INT-MAIN-JOB1-34.
11-May-2021 22:32:14 Force Stop build feature is enabled for current plan. Either Bamboo has detected the build has hung or it has been manually stopped.
11-May-2021 22:32:14 Has finished generating stack trace and terminating spawned sub-processes of process id: 7329