Build: #106 failed Scheduled

Build result summary

Details

Completed
Duration
5 minutes
Labels
None
Agent
bamboo-31.spring.vmware.com
Revision
bc8246d26719297f11ca961016a95ced53a9b9c3 bc8246d26719297f11ca961016a95ced53a9b9c3
Total tests
2687
Fixed in
#107 (Scheduled)

Tests

Responsible

No one has taken responsibility for this failure

Tests

New test failures 1
Status Test View job Duration
Collapse Failed FileTailingMessageProducerTests testApache History
Default Job 11 secs
java.lang.AssertionError: java.lang.AssertionError: [expected a non-null message] 
Expecting actual not to be null
java.lang.AssertionError: [expected a non-null message] 
Expecting actual not to be null
	at org.springframework.integration.file.tail.FileTailingMessageProducerTests.testGuts(FileTailingMessageProducerTests.java:229)
	at org.springframework.integration.file.tail.FileTailingMessageProducerTests.testApache(FileTailingMessageProducerTests.java:102)
	at java.base/jdk.internal.reflect.NativeMethodAccessorImpl.invoke0(Native Method)
	at java.base/jdk.internal.reflect.NativeMethodAccessorImpl.invoke(NativeMethodAccessorImpl.java:62)
(72 more lines...)