Build: #106 failed Scheduled

Test results

  • 2,687 tests in total
  • 1 test failed
  • 1 failure is new
  • 21 tests were quarantined / skipped
  • 2 minutes taken in total.
New test failures 1
Status Test View job Duration
Collapse Failed FileTailingMessageProducerTests testApache History
Default Job 11 secs
java.lang.AssertionError: java.lang.AssertionError: [expected a non-null message] 
Expecting actual not to be null
java.lang.AssertionError: [expected a non-null message] 
Expecting actual not to be null
	at org.springframework.integration.file.tail.FileTailingMessageProducerTests.testGuts(FileTailingMessageProducerTests.java:229)
	at org.springframework.integration.file.tail.FileTailingMessageProducerTests.testApache(FileTailingMessageProducerTests.java:102)
	at java.base/jdk.internal.reflect.NativeMethodAccessorImpl.invoke0(Native Method)
	at java.base/jdk.internal.reflect.NativeMethodAccessorImpl.invoke(NativeMethodAccessorImpl.java:62)
(72 more lines...)
Skipped tests 21
Status Test Failing since View job
Skipped AbstractCorrelatingMessageHandlerTests testScheduleRemoveAnEmptyGroupAfterConfiguredDelay() History
Default Job
Skipped AbstractCorrelatingMessageHandlerTests testDontReapMessageOfOtherHandler() History
Default Job
Skipped AggregatorTests testTrackedCorrelationIdsCapacityAtLimit History
Default Job
Skipped AggregatorTests testAggPerf History
Default Job
Skipped AggregatorTests testAggPerfDefaultPartial History
Default Job
Skipped AggregatorTests testTrackedCorrelationIdsCapacityPassesLimit History
Default Job
Skipped ConcurrentAggregatorTests testTrackedCorrelationIdsCapacityAtLimit() History
Default Job
Skipped ConcurrentAggregatorTests testCompleteGroupWithinTimeoutWithSameId() History
Default Job
Skipped ConcurrentAggregatorTests testTrackedCorrelationIdsCapacityPassesLimit() History
Default Job
Skipped AggregationResendTests testAggregatorWithTimeoutReturnsOnlyOneMessage History
Default Job
Skipped AggregationResendTests testAggregatorWithoutExplicitTimeoutReturnsOnlyOneMessage History
Default Job
Skipped NestedChainParserTests chainsAreNotSame History
Default Job
Skipped NestedChainParserTests handlersAreNotSame History
Default Job
Skipped MessageIdGenerationTests performanceTest() History
Default Job
Skipped AggregateMessageDeliveryExceptionTests shouldThrow History
Default Job
Skipped FeedInboundChannelAdapterParserTests validateSuccessfulNewsRetrievalWithHttpUrl History
Default Job
Skipped FileWritingMessageHandlerTests testCreateDirFail() History
Default Job
Skipped DelayHandlerTests testReschedulePersistedMessagesOnStartup History
Default Job
Skipped MethodInvokingMessageProcessorTests testProcessMessageMethodNotFound() History
Default Job
Skipped MessageHistoryIntegrationTests testMessageHistoryWithHistoryPerformance() History
Default Job
Skipped BeanFactoryTypeConverterTests initialConcurrency History
Default Job