Build: #28 failed Scheduled with changes by Gary Russell

Build result summary

Details

Completed
Duration
3 minutes
Labels
None
Agent
bamboo-33.spring.vmware.com
Revision
eba1c0507881401871bd6a718c628c40b7259bbb eba1c0507881401871bd6a718c628c40b7259bbb
Total tests
2329
Fixed in
#29 (Scheduled with changes by Artem Bilan)

Tests

Responsible

No one has taken responsibility for this failure

Code commits

Author Commit Message Commit date
Gary Russell Gary Russell eba1c0507881401871bd6a718c628c40b7259bbb eba1c0507881401871bd6a718c628c40b7259bbb Fix Signing Key Secret Name

Tests

New test failures 1
Status Test View job Duration
Collapse Failed ReactiveStreamsConsumerTests testReactiveStreamsConsumerPollableChannel() History
Default Job < 1 sec
java.lang.AssertionError: java.lang.AssertionError: 
Expecting:
  GenericMessage [payload=test, headers={id=3544d87e-7ba9-32f1-3ea4-6db335a62136, timestamp=1620184694858}]
and actual:
  GenericMessage [payload=test2, headers={id=0f31357d-423f-ec23-2e95-73f1914efd4d, timestamp=1620184694861}]
to refer to the same object
java.lang.AssertionError: 
Expecting:
(95 more lines...)