Build: #3 failed Scheduled with changes by Alexander Pinske <[email protected]> and Artem Bilan

Logs

The following logs have been generated by the jobs in this plan.
  • Expand all
  • Collapse all
Job Logs
Collapse Default Job Default Stage Download or View
10-Apr-2021 03:28:06     org.springframework.jms.UncategorizedJmsException at JmsInboundGatewayParserTests.java:329
10-Apr-2021 03:28:06         Caused by: javax.jms.JMSException at JmsInboundGatewayParserTests.java:329
10-Apr-2021 03:28:06             Caused by: javax.management.InstanceAlreadyExistsException at JmsInboundGatewayParserTests.java:329
10-Apr-2021 03:28:09
10-Apr-2021 03:28:09 205 tests completed, 14 failed, 1 skipped
10-Apr-2021 03:28:09
10-Apr-2021 03:28:09
10-Apr-2021 03:28:09 FAILURE: Build failed with an exception.
10-Apr-2021 03:28:09
10-Apr-2021 03:28:09 * What went wrong:
10-Apr-2021 03:28:09 Execution failed for task ':spring-integration-jms:testAll'.
10-Apr-2021 03:28:09 > There were failing tests. See the report at: file:///opt/bamboo-home/xml-data/build-dir/INT-MAINNIGHTLY-JOB1/spring-integration-jms/build/reports/tests/testAll/index.html
10-Apr-2021 03:28:09
10-Apr-2021 03:28:09 * Try:
10-Apr-2021 03:28:09 Run with --stacktrace option to get the stack trace. Run with --info or --debug option to get more log output. Run with --scan to get full insights.
10-Apr-2021 03:28:09
10-Apr-2021 03:28:09 * Get more help at https://help.gradle.org
10-Apr-2021 03:28:09
10-Apr-2021 03:28:09 BUILD FAILED in 12m 53s
10-Apr-2021 03:28:09 > Task :spring-integration-jms:testAll FAILED
10-Apr-2021 03:28:09
10-Apr-2021 03:28:09 Deprecated Gradle features were used in this build, making it incompatible with Gradle 7.0.
10-Apr-2021 03:28:09 Use '--warning-mode all' to show the individual deprecation warnings.
10-Apr-2021 03:28:09 See https://docs.gradle.org/6.8.2/userguide/command_line_interface.html#sec:command_line_warnings
10-Apr-2021 03:28:09 198 actionable tasks: 159 executed, 39 up-to-date