Build: #3 failed Scheduled with changes by Alexander Pinske <[email protected]> and Artem Bilan

Test results

  • 3,923 tests in total
  • 14 tests failed
  • 14 failures are new
  • 82 tests were quarantined / skipped
  • 8 minutes taken in total.
New test failures 14
Status Test View job Duration
Collapse Failed JmsInboundChannelAdapterTests initializationError History
Default Job < 1 sec
javax.jms.JMSException: javax.jms.JMSException: Could not create Transport. Reason: javax.management.InstanceAlreadyExistsException: org.apache.activemq:type=Broker,brokerName=localhost
javax.jms.JMSException: Could not create Transport. Reason: javax.management.InstanceAlreadyExistsException: org.apache.activemq:type=Broker,brokerName=localhost
	at org.apache.activemq.util.JMSExceptionSupport.create(JMSExceptionSupport.java:36)
	at org.apache.activemq.ActiveMQConnectionFactory.createTransport(ActiveMQConnectionFactory.java:333)
	at org.apache.activemq.ActiveMQConnectionFactory.createActiveMQConnection(ActiveMQConnectionFactory.java:346)
	at org.apache.activemq.ActiveMQConnectionFactory.createActiveMQConnection(ActiveMQConnectionFactory.java:304)
	at org.apache.activemq.ActiveMQConnectionFactory.createConnection(ActiveMQConnectionFactory.java:244)
	at org.springframework.jms.connection.SingleConnectionFactory.doCreateConnection(SingleConnectionFactory.java:410)
(99 more lines...)
Collapse Failed JmsOutboundChannelAdapterTests initializationError History
Default Job < 1 sec
javax.jms.JMSException: javax.jms.JMSException: Could not create Transport. Reason: javax.management.InstanceAlreadyExistsException: org.apache.activemq:type=Broker,brokerName=localhost
javax.jms.JMSException: Could not create Transport. Reason: javax.management.InstanceAlreadyExistsException: org.apache.activemq:type=Broker,brokerName=localhost
	at org.apache.activemq.util.JMSExceptionSupport.create(JMSExceptionSupport.java:36)
	at org.apache.activemq.ActiveMQConnectionFactory.createTransport(ActiveMQConnectionFactory.java:333)
	at org.apache.activemq.ActiveMQConnectionFactory.createActiveMQConnection(ActiveMQConnectionFactory.java:346)
	at org.apache.activemq.ActiveMQConnectionFactory.createActiveMQConnection(ActiveMQConnectionFactory.java:304)
	at org.apache.activemq.ActiveMQConnectionFactory.createConnection(ActiveMQConnectionFactory.java:244)
	at org.springframework.jms.connection.SingleConnectionFactory.doCreateConnection(SingleConnectionFactory.java:410)
(99 more lines...)
Collapse Failed JmsOutboundInsideChainTests initializationError History
Default Job < 1 sec
javax.jms.JMSException: javax.jms.JMSException: Could not create Transport. Reason: javax.management.InstanceAlreadyExistsException: org.apache.activemq:type=Broker,brokerName=localhost
javax.jms.JMSException: Could not create Transport. Reason: javax.management.InstanceAlreadyExistsException: org.apache.activemq:type=Broker,brokerName=localhost
	at org.apache.activemq.util.JMSExceptionSupport.create(JMSExceptionSupport.java:36)
	at org.apache.activemq.ActiveMQConnectionFactory.createTransport(ActiveMQConnectionFactory.java:333)
	at org.apache.activemq.ActiveMQConnectionFactory.createActiveMQConnection(ActiveMQConnectionFactory.java:346)
	at org.apache.activemq.ActiveMQConnectionFactory.createActiveMQConnection(ActiveMQConnectionFactory.java:304)
	at org.apache.activemq.ActiveMQConnectionFactory.createConnection(ActiveMQConnectionFactory.java:244)
	at org.springframework.jms.connection.SingleConnectionFactory.doCreateConnection(SingleConnectionFactory.java:410)
(99 more lines...)
Collapse Failed OutboundGatewayFunctionTests initializationError History
Default Job < 1 sec
javax.jms.JMSException: javax.jms.JMSException: Could not create Transport. Reason: javax.management.InstanceAlreadyExistsException: org.apache.activemq:type=Broker,brokerName=localhost
javax.jms.JMSException: Could not create Transport. Reason: javax.management.InstanceAlreadyExistsException: org.apache.activemq:type=Broker,brokerName=localhost
	at org.apache.activemq.util.JMSExceptionSupport.create(JMSExceptionSupport.java:36)
	at org.apache.activemq.ActiveMQConnectionFactory.createTransport(ActiveMQConnectionFactory.java:333)
	at org.apache.activemq.ActiveMQConnectionFactory.createActiveMQConnection(ActiveMQConnectionFactory.java:346)
	at org.apache.activemq.ActiveMQConnectionFactory.createActiveMQConnection(ActiveMQConnectionFactory.java:304)
	at org.apache.activemq.ActiveMQConnectionFactory.createConnection(ActiveMQConnectionFactory.java:244)
	at org.springframework.jms.connection.SingleConnectionFactory.doCreateConnection(SingleConnectionFactory.java:410)
(99 more lines...)
Collapse Failed PollableJmsChannelTests initializationError History
Default Job < 1 sec
javax.jms.JMSException: javax.jms.JMSException: Could not create Transport. Reason: javax.management.InstanceAlreadyExistsException: org.apache.activemq:type=Broker,brokerName=localhost
javax.jms.JMSException: Could not create Transport. Reason: javax.management.InstanceAlreadyExistsException: org.apache.activemq:type=Broker,brokerName=localhost
	at org.apache.activemq.util.JMSExceptionSupport.create(JMSExceptionSupport.java:36)
	at org.apache.activemq.ActiveMQConnectionFactory.createTransport(ActiveMQConnectionFactory.java:333)
	at org.apache.activemq.ActiveMQConnectionFactory.createActiveMQConnection(ActiveMQConnectionFactory.java:346)
	at org.apache.activemq.ActiveMQConnectionFactory.createActiveMQConnection(ActiveMQConnectionFactory.java:304)
	at org.apache.activemq.ActiveMQConnectionFactory.createConnection(ActiveMQConnectionFactory.java:244)
	at org.springframework.jms.connection.SingleConnectionFactory.doCreateConnection(SingleConnectionFactory.java:410)
(99 more lines...)
Collapse Failed SplitterAggregatorTests initializationError History
Default Job < 1 sec
javax.jms.JMSException: javax.jms.JMSException: Could not create Transport. Reason: javax.management.InstanceAlreadyExistsException: org.apache.activemq:type=Broker,brokerName=localhost
javax.jms.JMSException: Could not create Transport. Reason: javax.management.InstanceAlreadyExistsException: org.apache.activemq:type=Broker,brokerName=localhost
	at org.apache.activemq.util.JMSExceptionSupport.create(JMSExceptionSupport.java:36)
	at org.apache.activemq.ActiveMQConnectionFactory.createTransport(ActiveMQConnectionFactory.java:333)
	at org.apache.activemq.ActiveMQConnectionFactory.createActiveMQConnection(ActiveMQConnectionFactory.java:346)
	at org.apache.activemq.ActiveMQConnectionFactory.createActiveMQConnection(ActiveMQConnectionFactory.java:304)
	at org.apache.activemq.ActiveMQConnectionFactory.createConnection(ActiveMQConnectionFactory.java:244)
	at org.springframework.jms.connection.SingleConnectionFactory.doCreateConnection(SingleConnectionFactory.java:410)
(99 more lines...)
Collapse Failed SubscribableJmsChannelTests initializationError History
Default Job < 1 sec
javax.jms.JMSException: javax.jms.JMSException: Could not create Transport. Reason: javax.management.InstanceAlreadyExistsException: org.apache.activemq:type=Broker,brokerName=localhost
javax.jms.JMSException: Could not create Transport. Reason: javax.management.InstanceAlreadyExistsException: org.apache.activemq:type=Broker,brokerName=localhost
	at org.apache.activemq.util.JMSExceptionSupport.create(JMSExceptionSupport.java:36)
	at org.apache.activemq.ActiveMQConnectionFactory.createTransport(ActiveMQConnectionFactory.java:333)
	at org.apache.activemq.ActiveMQConnectionFactory.createActiveMQConnection(ActiveMQConnectionFactory.java:346)
	at org.apache.activemq.ActiveMQConnectionFactory.createActiveMQConnection(ActiveMQConnectionFactory.java:304)
	at org.apache.activemq.ActiveMQConnectionFactory.createConnection(ActiveMQConnectionFactory.java:244)
	at org.springframework.jms.connection.SingleConnectionFactory.doCreateConnection(SingleConnectionFactory.java:410)
(99 more lines...)
Collapse Failed JmsInboundGatewayParserTests gatewayWithReplyChannel History
Default Job < 1 sec
org.springframework.jms.UncategorizedJmsException: org.springframework.jms.UncategorizedJmsException: Uncategorized exception occurred during JMS processing; nested exception is javax.jms.JMSException: Could not create Transport. Reason: javax.management.InstanceAlreadyExistsException: org.apache.activemq:type=Broker,brokerName=localhost
org.springframework.jms.UncategorizedJmsException: Uncategorized exception occurred during JMS processing; nested exception is javax.jms.JMSException: Could not create Transport. Reason: javax.management.InstanceAlreadyExistsException: org.apache.activemq:type=Broker,brokerName=localhost
	at org.springframework.jms.support.JmsUtils.convertJmsAccessException(JmsUtils.java:311)
	at org.springframework.jms.support.JmsAccessor.convertJmsAccessException(JmsAccessor.java:185)
	at org.springframework.jms.core.JmsTemplate.execute(JmsTemplate.java:507)
	at org.springframework.jms.core.JmsTemplate.send(JmsTemplate.java:584)
	at org.springframework.jms.core.JmsTemplate.convertAndSend(JmsTemplate.java:661)
	at org.springframework.integration.jms.config.JmsInboundGatewayParserTests.gatewayWithReplyChannel(JmsInboundGatewayParserTests.java:329)
(96 more lines...)
Collapse Failed JmsDslKotlinTests initializationError History
Default Job < 1 sec
javax.jms.JMSException: javax.jms.JMSException: Could not create Transport. Reason: javax.management.InstanceAlreadyExistsException: org.apache.activemq:type=Broker,brokerName=localhost
javax.jms.JMSException: Could not create Transport. Reason: javax.management.InstanceAlreadyExistsException: org.apache.activemq:type=Broker,brokerName=localhost
	at org.apache.activemq.util.JMSExceptionSupport.create(JMSExceptionSupport.java:36)
	at org.apache.activemq.ActiveMQConnectionFactory.createTransport(ActiveMQConnectionFactory.java:333)
	at org.apache.activemq.ActiveMQConnectionFactory.createActiveMQConnection(ActiveMQConnectionFactory.java:346)
	at org.apache.activemq.ActiveMQConnectionFactory.createActiveMQConnection(ActiveMQConnectionFactory.java:304)
	at org.apache.activemq.ActiveMQConnectionFactory.createConnection(ActiveMQConnectionFactory.java:244)
	at org.springframework.jms.connection.SingleConnectionFactory.doCreateConnection(SingleConnectionFactory.java:410)
(99 more lines...)
Collapse Failed AsyncGatewayTests initializationError History
Default Job < 1 sec
javax.jms.JMSException: javax.jms.JMSException: Could not create Transport. Reason: javax.management.InstanceAlreadyExistsException: org.apache.activemq:type=Broker,brokerName=localhost
javax.jms.JMSException: Could not create Transport. Reason: javax.management.InstanceAlreadyExistsException: org.apache.activemq:type=Broker,brokerName=localhost
	at org.apache.activemq.util.JMSExceptionSupport.create(JMSExceptionSupport.java:36)
	at org.apache.activemq.ActiveMQConnectionFactory.createTransport(ActiveMQConnectionFactory.java:333)
	at org.apache.activemq.ActiveMQConnectionFactory.createActiveMQConnection(ActiveMQConnectionFactory.java:346)
	at org.apache.activemq.ActiveMQConnectionFactory.createActiveMQConnection(ActiveMQConnectionFactory.java:304)
	at org.apache.activemq.ActiveMQConnectionFactory.createConnection(ActiveMQConnectionFactory.java:244)
	at org.springframework.jms.connection.SingleConnectionFactory.doCreateConnection(SingleConnectionFactory.java:410)
(99 more lines...)
Collapse Failed MiscellaneousTests initializationError History
Default Job < 1 sec
javax.jms.JMSException: javax.jms.JMSException: Could not create Transport. Reason: javax.management.InstanceAlreadyExistsException: org.apache.activemq:type=Broker,brokerName=localhost
javax.jms.JMSException: Could not create Transport. Reason: javax.management.InstanceAlreadyExistsException: org.apache.activemq:type=Broker,brokerName=localhost
	at org.apache.activemq.util.JMSExceptionSupport.create(JMSExceptionSupport.java:36)
	at org.apache.activemq.ActiveMQConnectionFactory.createTransport(ActiveMQConnectionFactory.java:333)
	at org.apache.activemq.ActiveMQConnectionFactory.createActiveMQConnection(ActiveMQConnectionFactory.java:346)
	at org.apache.activemq.ActiveMQConnectionFactory.createActiveMQConnection(ActiveMQConnectionFactory.java:304)
	at org.apache.activemq.ActiveMQConnectionFactory.createConnection(ActiveMQConnectionFactory.java:244)
	at org.springframework.jms.connection.SingleConnectionFactory.doCreateConnection(SingleConnectionFactory.java:410)
(99 more lines...)
Collapse Failed RequestReplyScenariosWithTempReplyQueuesTests messageCorrelationBasedOnRequestCorrelationIdTimedOutFirstReply() History
Default Job 1 sec
org.springframework.messaging.MessageHandlingException: org.springframework.messaging.MessageHandlingException: failed to handle a message in the [bean 'org.springframework.integration.jms.JmsOutboundGateway#0'; defined in: 'class path resource [org/springframework/integration/jms/request_reply/producer-temp-reply-consumers.xml]'; from source: ''int-jms:outbound-gateway'']; nested exception is javax.jms.JMSException: Could not create Transport. Reason: javax.management.InstanceAlreadyExistsException: org.apache.activemq:type=Broker,brokerName=localhost, failedMessage=GenericMessage [payload=bar, headers={replyChannel=org.springframewor[email protected]115e9c80, errorChannel=org.springframewor[email protected]115e9c80, id=58193fd4-f8ca-18a8-0d43-37e2bfd101e3, timestamp=1618025285899}]
org.springframework.messaging.MessageHandlingException: failed to handle a message in the [bean 'org.springframework.integration.jms.JmsOutboundGateway#0'; defined in: 'class path resource [org/springframework/integration/jms/request_reply/producer-temp-reply-consumers.xml]'; from source: ''int-jms:outbound-gateway'']; nested exception is javax.jms.JMSException: Could not create Transport. Reason: javax.management.InstanceAlreadyExistsException: org.apache.activemq:type=Broker,brokerName=localhost, failedMessage=GenericMessage [payload=bar, headers={replyChannel=org.springframewor[email protected]115e9c80, errorChannel=org.springframewor[email protected]115e9c80, id=58193fd4-f8ca-18a8-0d43-37e2bfd101e3, timestamp=1618025285899}]
	at org.springframework.integration.jms.JmsOutboundGateway.handleRequestMessage(JmsOutboundGateway.java:760)
	at org.springframework.integration.handler.AbstractReplyProducingMessageHandler.handleMessageInternal(AbstractReplyProducingMessageHandler.java:134)
	at org.springframework.integration.handler.AbstractMessageHandler.handleMessage(AbstractMessageHandler.java:56)
	at org.springframework.integration.dispatcher.AbstractDispatcher.tryOptimizedDispatch(AbstractDispatcher.java:115)
	at org.springframework.integration.dispatcher.UnicastingDispatcher.doDispatch(UnicastingDispatcher.java:133)
	at org.springframework.integration.dispatcher.UnicastingDispatcher.dispatch(UnicastingDispatcher.java:106)
(138 more lines...)
Collapse Failed RequestReplyScenariosWithTempReplyQueuesTests testConcurrently() History
Default Job < 1 sec
org.opentest4j.AssertionFailedError: org.opentest4j.AssertionFailedError: 
expected: 0
but was : 30
org.opentest4j.AssertionFailedError: 
expected: 0
but was : 30
	at java.base/jdk.internal.reflect.NativeConstructorAccessorImpl.newInstance0(Native Method)
	at java.base/jdk.internal.reflect.NativeConstructorAccessorImpl.newInstance(NativeConstructorAccessorImpl.java:62)
(93 more lines...)
Collapse Failed StopStartTests initializationError History
Default Job < 1 sec
javax.jms.JMSException: javax.jms.JMSException: Could not create Transport. Reason: javax.management.InstanceAlreadyExistsException: org.apache.activemq:type=Broker,brokerName=localhost
javax.jms.JMSException: Could not create Transport. Reason: javax.management.InstanceAlreadyExistsException: org.apache.activemq:type=Broker,brokerName=localhost
	at org.apache.activemq.util.JMSExceptionSupport.create(JMSExceptionSupport.java:36)
	at org.apache.activemq.ActiveMQConnectionFactory.createTransport(ActiveMQConnectionFactory.java:333)
	at org.apache.activemq.ActiveMQConnectionFactory.createActiveMQConnection(ActiveMQConnectionFactory.java:346)
	at org.apache.activemq.ActiveMQConnectionFactory.createActiveMQConnection(ActiveMQConnectionFactory.java:304)
	at org.apache.activemq.ActiveMQConnectionFactory.createConnection(ActiveMQConnectionFactory.java:244)
	at org.springframework.jms.connection.SingleConnectionFactory.doCreateConnection(SingleConnectionFactory.java:410)
(99 more lines...)
Skipped tests 82
Status Test Failing since View job
Skipped AbstractCorrelatingMessageHandlerTests testDontReapMessageOfOtherHandler() History
Default Job
Skipped AbstractCorrelatingMessageHandlerTests testScheduleRemoveAnEmptyGroupAfterConfiguredDelay() History
Default Job
Skipped AggregatorTests testTrackedCorrelationIdsCapacityPassesLimit History
Default Job
Skipped AggregatorTests testTrackedCorrelationIdsCapacityAtLimit History
Default Job
Skipped AggregatorTests testAggPerf History
Default Job
Skipped AggregatorTests testAggPerfDefaultPartial History
Default Job
Skipped ConcurrentAggregatorTests testTrackedCorrelationIdsCapacityPassesLimit History
Default Job
Skipped ConcurrentAggregatorTests testTrackedCorrelationIdsCapacityAtLimit History
Default Job
Skipped ConcurrentAggregatorTests testCompleteGroupWithinTimeoutWithSameId History
Default Job
Skipped AggregationResendTests testAggregatorWithTimeoutReturnsOnlyOneMessage History
Default Job
Skipped AggregationResendTests testAggregatorWithoutExplicitTimeoutReturnsOnlyOneMessage History
Default Job
Skipped NestedChainParserTests handlersAreNotSame History
Default Job
Skipped NestedChainParserTests chainsAreNotSame History
Default Job
Skipped MessageIdGenerationTests performanceTest() History
Default Job
Skipped AggregateMessageDeliveryExceptionTests shouldThrow History
Default Job
Skipped FeedInboundChannelAdapterParserTests validateSuccessfulNewsRetrievalWithHttpUrl History
Default Job
Skipped FileWritingMessageHandlerTests testCreateDirFail() History
Default Job
Skipped FtpInboundOutboundSanitySample testFtpInboundChannelAdapter() History
Default Job
Skipped FtpInboundOutboundSanitySample testFtpOutboundChannelAdapter() History
Default Job
Skipped BigMGetTests doTest() History
Default Job
Skipped SessionFactoryTests testConnectionLimit() History
Default Job
Skipped GemfireGroupStoreTests testConcurrentModifications History
Default Job
Skipped GroovyScriptExecutingMessageProcessorTests testRefreshableScriptExecution History
Default Job
Skipped DelayHandlerTests testReschedulePersistedMessagesOnStartup History
Default Job
Skipped MethodInvokingMessageProcessorTests testProcessMessageMethodNotFound() History
Default Job
Skipped MessageHistoryIntegrationTests testMessageHistoryWithHistoryPerformance() History
Default Job
Skipped DefaultHttpHeaderMapperFromMessageOutboundTests perf History
Default Job
Skipped TcpNioConnectionTests testNoDelayOnClose() History
Default Job
Skipped MultiClientTests testAck History
Default Job
Skipped MultiClientTests testNoAck History
Default Job
Skipped MultiClientTests testAckWithLength History
Default Job
Skipped JdbcLockRegistryLeaderInitiatorTests testLostConnection History
Default Job
Skipped MySqlJdbcMessageStoreMultipleChannelTests testSendAndActivateTransactionalSend History
Default Job
Skipped MySqlJdbcMessageStoreTests testRemoveMessageGroup History
Default Job
Skipped MySqlJdbcMessageStoreTests testAddAndRemoveMessageGroup History
Default Job
Skipped MySqlJdbcMessageStoreTests testSameMessageToMultipleGroups History
Default Job
Skipped MySqlJdbcMessageStoreTests testAddAndGetMessageGroup History
Default Job
Skipped MySqlJdbcMessageStoreTests testCompleteMessageGroup History
Default Job
Skipped MySqlJdbcMessageStoreTests testAddAndUpdate History
Default Job
Skipped MySqlJdbcMessageStoreTests testWithMessageHistory History
Default Job
Skipped MySqlJdbcMessageStoreTests testMessageGroupSizes History
Default Job
Skipped MySqlJdbcMessageStoreTests testAddAndGetWithDifferentRegion History
Default Job
Skipped MySqlJdbcMessageStoreTests testSameMessageAndGroupToMultipleRegions History
Default Job
Skipped MySqlJdbcMessageStoreTests testUpdateLastReleasedSequence History
Default Job
Skipped MySqlJdbcMessageStoreTests testOrderInMessageGroup History
Default Job
Skipped MySqlJdbcMessageStoreTests testAddAndUpdateAlreadySavedAndCopied History
Default Job
Skipped MySqlJdbcMessageStoreTests testGetNonExistent History
Default Job
Skipped MySqlJdbcMessageStoreTests testMessageGroupCount History
Default Job
Skipped MySqlJdbcMessageStoreTests testAddAndUpdateAlreadySaved History
Default Job
Skipped MySqlJdbcMessageStoreTests testExpireMessageGroupOnIdleOnly History
Default Job
Skipped MySqlJdbcMessageStoreTests testSerializer History
Default Job
Skipped MySqlJdbcMessageStoreTests testExpireMessageGroupOnCreateOnly History
Default Job
Skipped MySqlJdbcMessageStoreTests testAddAndGet History
Default Job
Skipped MySqlJdbcMessageStoreTests testSize History
Default Job
Skipped MySqlJdbcMessageStoreTests testAddAndRemoveMessageFromMessageGroup History
Default Job
Skipped MySqlJdbcMessageStoreTests testMessagePollingFromTheGroup History
Default Job
Skipped MySqlJdbcMessageStoreTests testAddAndUpdateWithChange History
Default Job
Skipped DerbyTxTimeoutMessageStoreTests test History
Default Job
Skipped DerbyTxTimeoutMessageStoreTests testPriorityChannel History
Default Job
Skipped DerbyTxTimeoutMessageStoreTests testInt3181ConcurrentPolling History
Default Job
Skipped DerbyTxTimeoutMessageStoreTests testInt2993IdCacheConcurrency History
Default Job
Skipped DerbyTxTimeoutMessageStoreTests testMessageSequenceColumn History
Default Job
Skipped MySqlJdbcChannelMessageStoreTests testAddAndGet History
Default Job
Skipped MySqlJdbcChannelMessageStoreTests testGetNonExistentMessageFromGroup History
Default Job
Skipped MySqlJdbcChannelMessageStoreTests testAddAndGetCustomStatementSetter History
Default Job
Skipped MySqlTxTimeoutMessageStoreTests testInt3181ConcurrentPolling History
Default Job
Skipped MySqlTxTimeoutMessageStoreTests test History
Default Job
Skipped MySqlTxTimeoutMessageStoreTests testPriorityChannel History
Default Job
Skipped MySqlTxTimeoutMessageStoreTests testInt2993IdCacheConcurrency History
Default Job
Skipped MySqlTxTimeoutMessageStoreTests testMessageSequenceColumn History
Default Job
Skipped OracleTxTimeoutMessageStoreTests testInt2993IdCacheConcurrency History
Default Job
Skipped OracleTxTimeoutMessageStoreTests testPriorityChannel History
Default Job
Skipped OracleTxTimeoutMessageStoreTests testInt3181ConcurrentPolling History
Default Job
Skipped OracleTxTimeoutMessageStoreTests test History
Default Job
Skipped OracleTxTimeoutMessageStoreTests testMessageSequenceColumn History
Default Job
Skipped PostgresTxTimeoutMessageStoreTests testInt2993IdCacheConcurrency History
Default Job
Skipped PostgresTxTimeoutMessageStoreTests testMessageSequenceColumn History
Default Job
Skipped PostgresTxTimeoutMessageStoreTests test History
Default Job
Skipped PostgresTxTimeoutMessageStoreTests testInt3181ConcurrentPolling History
Default Job
Skipped PostgresTxTimeoutMessageStoreTests testPriorityChannel History
Default Job
Skipped OutboundGatewayConnectionTests testContainerWithDestBrokenConnection() History
Default Job
Skipped BeanFactoryTypeConverterTests initialConcurrency History
Default Job