spring-projects/spring-integration master branch

Build: #1616 failed

Job: Default Job failed

Stages & jobs

  1. Default Stage

Job result summary

Completed
Duration
6 minutes
Agent
bamboo-22.af.pivotal.io
Revision
77954966cb04e7195b475aab4ba6b2c41ef27caf 77954966cb04e7195b475aab4ba6b2c41ef27caf
Total tests
4555
Failing since
#1612 (Rebuilt by Artem Bilan)
Fixed in
#1617 (Code changes detected)

Tests

  • 4,555 tests in total
  • 1 test failed
  • 1 failure is new
  • 249 tests were quarantined / skipped
  • 7 minutes taken in total.
New test failures 1
Status Test Duration
Collapse Failed RSocketDslTests testRsocketUpperCaseFlows() History
< 1 sec
org.springframework.messaging.MessageHandlingException: org.springframework.messaging.MessageHandlingException: nested exception is io.netty.channel.AbstractChannel$AnnotatedConnectException: syscall:getsockopt(..) failed: Connection refused: /0:0:0:0:0:0:0:1:34825, failedMessage=GenericMessage [payload=hello world, headers={replyChannel=org.springframework.messaging.core.GenericMessagingTemplate$TemporaryReplyChannel@78d26d9b, errorChannel=org.springframework.messaging.core.GenericMessagingTemplate$TemporaryReplyChannel@78d26d9b, id=f2f33040-1f9a-7a10-8abc-abe82c77376e, timestamp=1561651230270}]
org.springframework.messaging.MessageHandlingException: nested exception is io.netty.channel.AbstractChannel$AnnotatedConnectException: syscall:getsockopt(..) failed: Connection refused: /0:0:0:0:0:0:0:1:34825, failedMessage=GenericMessage [payload=hello world, headers={replyChannel=org.springframework.messaging.core.GenericMessagingTemplate$TemporaryReplyChannel@78d26d9b, errorChannel=org.springframework.messaging.core.GenericMessagingTemplate$TemporaryReplyChannel@78d26d9b, id=f2f33040-1f9a-7a10-8abc-abe82c77376e, timestamp=1561651230270}]
	at org.springframework.integration.handler.AbstractMessageProducingHandler.sendErrorMessage(AbstractMessageProducingHandler.java:439)
	at org.springframework.integration.handler.AbstractMessageProducingHandler$ReplyFutureCallback.onFailure(AbstractMessageProducingHandler.java:504)
	at org.springframework.util.concurrent.ListenableFutureCallbackRegistry.notifyFailure(ListenableFutureCallbackRegistry.java:86)
	at org.springframework.util.concurrent.ListenableFutureCallbackRegistry.addCallback(ListenableFutureCallbackRegistry.java:67)
	at org.springframework.util.concurrent.ListenableFutureTask.addCallback(ListenableFutureTask.java:61)
	at org.springframework.util.concurrent.SettableListenableFuture.addCallback(SettableListenableFuture.java:76)
(110 more lines...)

Error summary

The build generated some errors. See the full build log for more details.

warning: [deprecation] setTxSize(int) in SimpleMessageListenerContainer has been deprecated
warning: [deprecation] setTxSize(int) in SimpleMessageListenerContainer has been deprecated
2 warnings
*** java.lang.instrument ASSERTION FAILED ***: "!errorOutstanding" with message transform method call failed at JPLISAgent.c line: 844
*** java.lang.instrument ASSERTION FAILED ***: "!errorOutstanding" with message transform method call failed at JPLISAgent.c line: 844
*** java.lang.instrument ASSERTION FAILED ***: "!errorOutstanding" with message transform method call failed at JPLISAgent.c line: 844
javadoc: warning - Multiple sources of package comments found for package "javax.servlet"
javadoc: warning - Multiple sources of package comments found for package "javax.servlet.http"
javadoc: warning - Multiple sources of package comments found for package "javax.servlet.annotation"

27 tests completed, 1 failed

FAILURE: Build failed with an exception.

* What went wrong:
Execution failed for task ':spring-integration-rsocket:test'.
> There were failing tests. See the report at: file:///opt/bamboo-home/xml-data/build-dir/INT-MASTER-JOB1/spring-integration-rsocket/build/reports/tests/test/index.html

* Try:
Run with --stacktrace option to get the stack trace. Run with --info or --debug option to get more log output. Run with --scan to get full insights.

* Get more help at https://help.gradle.org

BUILD FAILED in 6m 40s