spring-projects/spring-integration master branch

Build: #1623 failed

Job: Default Job failed

Stages & jobs

  1. Default Stage

Job result summary

Completed
Duration
3 minutes
Agent
bamboo-15.af.pivotal.io
Revision
5e1a92db2eb8d36c0e7ad99250d7ae0edd36f787 5e1a92db2eb8d36c0e7ad99250d7ae0edd36f787
Total tests
2608
Fixed in
#1625 (Code changes detected)

Tests

  • 2,608 tests in total
  • 1 test failed
  • 1 failure is new
  • 49 tests were quarantined / skipped
  • 1 minute taken in total.
New test failures 1
Status Test Duration
Collapse Failed OutboundEndpointTests testHeaderMapperWinsGateway History
< 1 sec
org.springframework.messaging.MessageHandlingException: org.springframework.messaging.MessageHandlingException: error occurred in message handler [org.springframework.integration.amqp.outbound.AmqpOutboundEndpoint@2a489a53]; nested exception is java.lang.IllegalStateException: Connection factory returned a null connection, failedMessage=GenericMessage [payload=foo, headers={replyChannel=org.springframework.integration.channel.QueueChannel@5f78a37f, id=3dc0f65b-60c6-ec22-6cc9-afba1b9cb399, contentType=bar, timestamp=1562006386017}]
org.springframework.messaging.MessageHandlingException: error occurred in message handler [org.springframework.integration.amqp.outbound.AmqpOutboundEndpoint@2a489a53]; nested exception is java.lang.IllegalStateException: Connection factory returned a null connection, failedMessage=GenericMessage [payload=foo, headers={replyChannel=org.springframework.integration.channel.QueueChannel@5f78a37f, id=3dc0f65b-60c6-ec22-6cc9-afba1b9cb399, contentType=bar, timestamp=1562006386017}]
	at org.springframework.integration.support.utils.IntegrationUtils.wrapInHandlingExceptionIfNecessary(IntegrationUtils.java:191)
	at org.springframework.integration.handler.AbstractMessageHandler.handleMessage(AbstractMessageHandler.java:187)
	at org.springframework.integration.amqp.outbound.OutboundEndpointTests.testHeaderMapperWinsGateway(OutboundEndpointTests.java:154)
	at sun.reflect.NativeMethodAccessorImpl.invoke0(Native Method)
	at sun.reflect.NativeMethodAccessorImpl.invoke(NativeMethodAccessorImpl.java:62)
	at sun.reflect.DelegatingMethodAccessorImpl.invoke(DelegatingMethodAccessorImpl.java:43)
(76 more lines...)

Error summary

The build generated some errors. See the full build log for more details.

warning: [deprecation] setTxSize(int) in SimpleMessageListenerContainer has been deprecated
warning: [deprecation] setTxSize(int) in SimpleMessageListenerContainer has been deprecated
2 warnings

92 tests completed, 1 failed
*** java.lang.instrument ASSERTION FAILED ***: "!errorOutstanding" with message transform method call failed at JPLISAgent.c line: 844
*** java.lang.instrument ASSERTION FAILED ***: "!errorOutstanding" with message transform method call failed at JPLISAgent.c line: 844
*** java.lang.instrument ASSERTION FAILED ***: "!errorOutstanding" with message transform method call failed at JPLISAgent.c line: 844
*** java.lang.instrument ASSERTION FAILED ***: "!errorOutstanding" with message transform method call failed at JPLISAgent.c line: 844
*** java.lang.instrument ASSERTION FAILED ***: "!errorOutstanding" with message transform method call failed at JPLISAgent.c line: 844

FAILURE: Build failed with an exception.

* What went wrong:
Execution failed for task ':spring-integration-amqp:test'.
> There were failing tests. See the report at: file:///opt/bamboo-home/xml-data/build-dir/INT-MASTER-JOB1/spring-integration-amqp/build/reports/tests/test/index.html

* Try:
Run with --stacktrace option to get the stack trace. Run with --info or --debug option to get more log output. Run with --scan to get full insights.

* Get more help at https://help.gradle.org

BUILD FAILED in 3m 32s