spring-projects/spring-integration master branch

Build: #1637 failed

Job: Default Job failed

Stages & jobs

  1. Default Stage

Job result summary

Completed
Duration
3 minutes
Agent
bamboo-18.af.pivotal.io
Revision
733b8955444b67b367887c2c0d6890d91d649d75 733b8955444b67b367887c2c0d6890d91d649d75
Fixed in
#1639 (Rebuilt by Artem Bilan)
No failed tests found, a possible compilation error occurred.

Error summary

The build generated some errors. See the full build log for more details.

Could not find test result reports in the /opt/bamboo-home/xml-data/build-dir/INT-MASTER-JOB1 directory.
/opt/bamboo-home/xml-data/build-dir/INT-MASTER-JOB1/spring-integration-rsocket/src/main/java/org/springframework/integration/rsocket/AbstractRSocketConnector.java:30: error: cannot find symbol
import org.springframework.messaging.rsocket.annotation.support.MetadataExtractor;
                                                               ^
  symbol:   class MetadataExtractor
  location: package org.springframework.messaging.rsocket.annotation.support
/opt/bamboo-home/xml-data/build-dir/INT-MASTER-JOB1/spring-integration-rsocket/src/main/java/org/springframework/integration/rsocket/AbstractRSocketConnector.java:135: error: cannot find symbol
        public void setMetadataExtractor(MetadataExtractor extractor) {
                                         ^
  symbol:   class MetadataExtractor
  location: class AbstractRSocketConnector
2 errors

FAILURE: Build failed with an exception.

* What went wrong:
Execution failed for task ':spring-integration-rsocket:compileJava'.
> Compilation failed; see the compiler error output for details.

* Try:
Run with --stacktrace option to get the stack trace. Run with --info or --debug option to get more log output. Run with --scan to get full insights.

* Get more help at https://help.gradle.org

BUILD FAILED in 2m 59s