spring-projects/spring-integration master branch

Build: #1638 failed

Job: Default Job failed

Stages & jobs

  1. Default Stage

Job result summary

Completed
Duration
3 minutes
Agent
bamboo-22.af.pivotal.io
Revision
34723fb9466c05d9273fce39279cf258c729cd4f 34723fb9466c05d9273fce39279cf258c729cd4f
Total tests
92
Failing since
#1637 (Code changes detected – )
Fixed in
#1639 (Rebuilt by Artem Bilan)
No failed tests found, a possible compilation error occurred.

Tests

  • 92 tests in total
  • 16 seconds taken in total.

Error summary

The build generated some errors. See the full build log for more details.

[ant:checkstyle] [ERROR] /opt/bamboo-home/xml-data/build-dir/INT-MASTER-JOB1/spring-integration-core/src/main/java/org/springframework/integration/handler/LambdaMessageProcessor.java:107:56: '(' is followed by whitespace. [ParenPad]

FAILURE: Build failed with an exception.

* What went wrong:
Execution failed for task ':spring-integration-core:checkstyleMain'.
> Checkstyle rule violations were found. See the report at: file:///opt/bamboo-home/xml-data/build-dir/INT-MASTER-JOB1/spring-integration-core/build/reports/checkstyle/main.html
  Checkstyle files with violations: 1
  Checkstyle violations by severity: [error:1]


* Try:
Run with --stacktrace option to get the stack trace. Run with --info or --debug option to get more log output. Run with --scan to get full insights.

* Get more help at https://help.gradle.org

BUILD FAILED in 3m 5s