spring-projects/spring-integration master branch

Build: #1660 failed

Job: Default Job failed

Stages & jobs

  1. Default Stage

Job result summary

Completed
Duration
2 minutes
Agent
bamboo-20.af.pivotal.io
Revision
d2dc9c5dba609643fb6aab75dc6e8d00043d80d5 d2dc9c5dba609643fb6aab75dc6e8d00043d80d5
Fixed in
#1661 (Code changes detected)
No failed tests found, a possible compilation error occurred.

Error summary

The build generated some errors. See the full build log for more details.

Could not find test result reports in the /opt/bamboo-home/xml-data/build-dir/INT-MASTER-JOB1 directory.
/opt/bamboo-home/xml-data/build-dir/INT-MASTER-JOB1/spring-integration-test-support/src/main/java/org/springframework/integration/test/matcher/PayloadMatcher.java:47: error: unknown tag: BigDecimal
* Message<BigDecimal> message = MessageBuilder.withPayload(ANY_PAYLOAD).build();
          ^

FAILURE: Build failed with an exception.

* What went wrong:
Execution failed for task ':spring-integration-test-support:javadoc'.
> Javadoc generation failed. Generated Javadoc options file (useful for troubleshooting): '/opt/bamboo-home/xml-data/build-dir/INT-MASTER-JOB1/spring-integration-test-support/build/tmp/javadoc/javadoc.options'

* Try:
Run with --stacktrace option to get the stack trace. Run with --info or --debug option to get more log output. Run with --scan to get full insights.

* Get more help at https://help.gradle.org

BUILD FAILED in 2m 29s