spring-projects/spring-integration master branch

Build: #1663 failed

Job: Default Job failed

Stages & jobs

  1. Default Stage

Job result summary

Completed
Duration
3 minutes
Agent
bamboo-21.af.pivotal.io
Revision
580ca865fee6316309fc0c1a9d99be78758f2939 580ca865fee6316309fc0c1a9d99be78758f2939
Total tests
129
Failing since
#1662 (Code changes detected – )
Fixed in
#1664 (Code changes detected)
No failed tests found, a possible compilation error occurred.

Tests

  • 129 tests in total
  • 1 test was quarantined / skipped
  • 29 seconds taken in total.

Error summary

The build generated some errors. See the full build log for more details.

[ant:checkstyle] [ERROR] /opt/bamboo-home/xml-data/build-dir/INT-MASTER-JOB1/spring-integration-core/src/test/java/org/springframework/integration/dsl/correlation/CorrelationHandlerTests.java:60: Extra separation in import group before 'reactor.core.publisher.Flux' [ImportOrder]

FAILURE: Build failed with an exception.

* What went wrong:
Execution failed for task ':spring-integration-core:checkstyleTest'.
> Checkstyle rule violations were found. See the report at: file:///opt/bamboo-home/xml-data/build-dir/INT-MASTER-JOB1/spring-integration-core/build/reports/checkstyle/test.html
  Checkstyle files with violations: 1
  Checkstyle violations by severity: [error:1]


* Try:
Run with --stacktrace option to get the stack trace. Run with --info or --debug option to get more log output. Run with --scan to get full insights.

* Get more help at https://help.gradle.org

BUILD FAILED in 3m 32s