spring-projects/spring-integration master branch

Build: #1680 failed

Job: Default Job failed

Stages & jobs

  1. Default Stage

Job result summary

Completed
Duration
33 seconds
Agent
bamboo-24.af.pivotal.io
Revision
a09b97949e311a5ceca1ca76f8438ddf932a35d0 a09b97949e311a5ceca1ca76f8438ddf932a35d0
Fixed in
#1681 (Rebuilt by Artem Bilan)
No failed tests found, a possible compilation error occurred.

Error summary

The build generated some errors. See the full build log for more details.

Could not find test result reports in the /opt/bamboo-home/xml-data/build-dir/INT-MASTER-JOB1 directory.
Exception in thread "main" org.asciidoctor.gradle.backported.AsciidoctorRemoteExecutionException: Error running Asciidoctor whilst attempting to process /opt/bamboo-home/xml-data/build-dir/INT-MASTER-JOB1/build/asciidoc/index-single.adoc using backend pdf
        at org.asciidoctor.gradle.backported.AsciidoctorJavaExec$_convertFiles_closure3.doCall(AsciidoctorJavaExec.groovy:63)
        at sun.reflect.NativeMethodAccessorImpl.invoke0(Native Method)
        at sun.reflect.NativeMethodAccessorImpl.invoke(NativeMethodAccessorImpl.java:62)
        at sun.reflect.DelegatingMethodAccessorImpl.invoke(DelegatingMethodAccessorImpl.java:43)
        at java.lang.reflect.Method.invoke(Method.java:498)
        at org.codehaus.groovy.reflection.CachedMethod.invoke(CachedMethod.java:98)
        at groovy.lang.MetaMethod.doMethodInvoke(MetaMethod.java:325)
        at org.codehaus.groovy.runtime.metaclass.ClosureMetaClass.invokeMethod(ClosureMetaClass.java:264)
        at groovy.lang.MetaClassImpl.invokeMethod(MetaClassImpl.java:1034)
        at groovy.lang.Closure.call(Closure.java:418)
        at groovy.lang.Closure.call(Closure.java:434)
        at org.codehaus.groovy.runtime.DefaultGroovyMethods.each(DefaultGroovyMethods.java:2125)
        at org.codehaus.groovy.runtime.DefaultGroovyMethods.each(DefaultGroovyMethods.java:2110)
        at org.codehaus.groovy.runtime.DefaultGroovyMethods.each(DefaultGroovyMethods.java:2163)
        at org.asciidoctor.gradle.backported.AsciidoctorJavaExec.convertFiles(AsciidoctorJavaExec.groovy:56)
        at org.asciidoctor.gradle.backported.AsciidoctorJavaExec.access$0(AsciidoctorJavaExec.groovy)
        at org.asciidoctor.gradle.backported.AsciidoctorJavaExec$_run_closure2.doCall(AsciidoctorJavaExec.groovy:50)
        at org.asciidoctor.gradle.backported.AsciidoctorJavaExec$_run_closure2.call(AsciidoctorJavaExec.groovy)
        at org.codehaus.groovy.runtime.DefaultGroovyMethods.each(DefaultGroovyMethods.java:2125)
        at org.codehaus.groovy.runtime.DefaultGroovyMethods.each(DefaultGroovyMethods.java:2110)
        at org.codehaus.groovy.runtime.DefaultGroovyMethods.each(DefaultGroovyMethods.java:2151)
        at org.asciidoctor.gradle.backported.AsciidoctorJavaExec.run(AsciidoctorJavaExec.groovy:48)
        at org.asciidoctor.gradle.backported.AsciidoctorJavaExec.main(AsciidoctorJavaExec.groovy:194)
Caused by: org.jruby.exceptions.RaiseException: (SyntaxError) /opt/users/bamboo/.gradle/caches/modules-2/files-2.1/org.asciidoctor/asciidoctorj-pdf/1.5.0-alpha.18/641d4e6630391e8935fbca5c570b8c69a50d8906/asciidoctorj-pdf-1.5.0-alpha.18.jar!/gems/asciidoctor-pdf-1.5.0.alpha.18/lib/asciidoctor-pdf/core_ext/numeric.rb:2: syntax error, unexpected kDO_BLOCK
Float.prepend (Module.new do
^
        at org.jruby.RubyKernel.require(org/jruby/RubyKernel.java:1040)
        at RUBY.require(/opt/users/bamboo/.gradle/caches/modules-2/files-2.1/org.jruby/jruby-complete/1.7.26/c09885af02af34266ed929f94cedcf87cc965f46/jruby-complete-1.7.26.jar!/META-INF/jruby.home/lib/ruby/shared/rubygems/core_ext/kernel_require.rb:121)
        at RUBY.require_relative(file:/opt/users/bamboo/.gradle/caches/modules-2/files-2.1/org.jruby/jruby-complete/1.7.26/c09885af02af34266ed929f94cedcf87cc965f46/jruby-complete-1.7.26.jar!/jruby/kernel19/kernel.rb:13)
        at RUBY.(root)(/opt/users/bamboo/.gradle/caches/modules-2/files-2.1/org.asciidoctor/asciidoctorj-pdf/1.5.0-alpha.18/641d4e6630391e8935fbca5c570b8c69a50d8906/asciidoctorj-pdf-1.5.0-alpha.18.jar!/gems/asciidoctor-pdf-1.5.0.alpha.18/lib/asciidoctor-pdf/core_ext.rb:3)
        at org.jruby.RubyKernel.require(org/jruby/RubyKernel.java:1040)
        at RUBY.(root)(/opt/users/bamboo/.gradle/caches/modules-2/files-2.1/org.jruby/jruby-complete/1.7.26/c09885af02af34266ed929f94cedcf87cc965f46/jruby-complete-1.7.26.jar!/META-INF/jruby.home/lib/ruby/shared/rubygems/core_ext/kernel_require.rb:1)
        at RUBY.require(/opt/users/bamboo/.gradle/caches/modules-2/files-2.1/org.jruby/jruby-complete/1.7.26/c09885af02af34266ed929f94cedcf87cc965f46/jruby-complete-1.7.26.jar!/META-INF/jruby.home/lib/ruby/shared/rubygems/core_ext/kernel_require.rb:121)
        at RUBY.require_relative(file:/opt/users/bamboo/.gradle/caches/modules-2/files-2.1/org.jruby/jruby-complete/1.7.26/c09885af02af34266ed929f94cedcf87cc965f46/jruby-complete-1.7.26.jar!/jruby/kernel19/kernel.rb:13)
        at org.jruby.RubyKernel.require(org/jruby/RubyKernel.java:1040)
        at RUBY.(root)(/opt/users/bamboo/.gradle/caches/modules-2/files-2.1/org.asciidoctor/asciidoctorj-pdf/1.5.0-alpha.18/641d4e6630391e8935fbca5c570b8c69a50d8906/asciidoctorj-pdf-1.5.0-alpha.18.jar!/gems/asciidoctor-pdf-1.5.0.alpha.18/lib/asciidoctor-pdf/converter.rb:12)
        at RUBY.(root)(/opt/users/bamboo/.gradle/caches/modules-2/files-2.1/org.jruby/jruby-complete/1.7.26/c09885af02af34266ed929f94cedcf87cc965f46/jruby-complete-1.7.26.jar!/META-INF/jruby.home/lib/ruby/shared/rubygems/core_ext/kernel_require.rb:1)
        at RUBY.require(/opt/users/bamboo/.gradle/caches/modules-2/files-2.1/org.jruby/jruby-complete/1.7.26/c09885af02af34266ed929f94cedcf87cc965f46/jruby-complete-1.7.26.jar!/META-INF/jruby.home/lib/ruby/shared/rubygems/core_ext/kernel_require.rb:121)
        at org.jruby.RubyKernel.require(org/jruby/RubyKernel.java:1040)
        at RUBY.require_relative(file:/opt/users/bamboo/.gradle/caches/modules-2/files-2.1/org.jruby/jruby-complete/1.7.26/c09885af02af34266ed929f94cedcf87cc965f46/jruby-complete-1.7.26.jar!/jruby/kernel19/kernel.rb:13)
        at RUBY.(root)(/opt/users/bamboo/.gradle/caches/modules-2/files-2.1/org.asciidoctor/asciidoctorj-pdf/1.5.0-alpha.18/641d4e6630391e8935fbca5c570b8c69a50d8906/asciidoctorj-pdf-1.5.0-alpha.18.jar!/gems/asciidoctor-pdf-1.5.0.alpha.18/lib/asciidoctor-pdf.rb:4)
        at org.asciidoctor.gradle.backported.AsciidoctorJavaExec$_convertFiles_closure3.doCall(AsciidoctorJavaExec.groovy:61)
        at org.asciidoctor.gradle.backported.AsciidoctorJavaExec.convertFiles(AsciidoctorJavaExec.groovy:56)
        at org.asciidoctor.gradle.backported.AsciidoctorJavaExec$_run_closure2.doCall(AsciidoctorJavaExec.groovy:50)
        ... 2 more

FAILURE: Build failed with an exception.

* What went wrong:
Execution failed for task ':makePDF'.
> Process 'command '/opt/jdk8u212-b03/bin/java'' finished with non-zero exit value 1

* Try:
Run with --stacktrace option to get the stack trace. Run with --info or --debug option to get more log output. Run with --scan to get full insights.

* Get more help at https://help.gradle.org

BUILD FAILED in 32s