spring-projects/spring-integration master branch

Build: #1685 failed

Job: Default Job failed

Stages & jobs

  1. Default Stage

Job result summary

Completed
Duration
2 minutes
Agent
bamboo-20.af.pivotal.io
Revision
b01982de41896d355e56635a06ee39b13873f32c b01982de41896d355e56635a06ee39b13873f32c
Fixed in
#1686 (Code changes detected)
No failed tests found, a possible compilation error occurred.

Error summary

The build generated some errors. See the full build log for more details.

Could not find test result reports in the /opt/bamboo-home/xml-data/build-dir/INT-MASTER-JOB1 directory.
[ant:checkstyle] [ERROR] /opt/bamboo-home/xml-data/build-dir/INT-MASTER-JOB1/spring-integration-test-support/src/main/java/org/springframework/integration/test/rule/Log4j2LevelAdjuster.java:22:8: Unused import - org.apache.commons.logging.Log. [UnusedImports]
[ant:checkstyle] [ERROR] /opt/bamboo-home/xml-data/build-dir/INT-MASTER-JOB1/spring-integration-test-support/src/main/java/org/springframework/integration/test/rule/Log4j2LevelAdjuster.java:23:8: Unused import - org.apache.commons.logging.LogFactory. [UnusedImports]

FAILURE: Build failed with an exception.

* What went wrong:
Execution failed for task ':spring-integration-test-support:checkstyleMain'.
> Checkstyle rule violations were found. See the report at: file:///opt/bamboo-home/xml-data/build-dir/INT-MASTER-JOB1/spring-integration-test-support/build/reports/checkstyle/main.html
  Checkstyle files with violations: 1
  Checkstyle violations by severity: [error:2]


* Try:
Run with --stacktrace option to get the stack trace. Run with --info or --debug option to get more log output. Run with --scan to get full insights.

* Get more help at https://help.gradle.org

BUILD FAILED in 2m 30s