spring-projects/spring-integration master branch

Build: #1689 failed

Job: Default Job failed

Stages & jobs

  1. Default Stage

Job result summary

Completed
Duration
6 minutes
Agent
bamboo-23.af.pivotal.io
Revision
b7e928b846323f10a52b15f6142a4ffa08329c6a b7e928b846323f10a52b15f6142a4ffa08329c6a
Total tests
4548
Fixed in
#1690 (Manual run by Artem Bilan)

Tests

  • 4,548 tests in total
  • 4 tests failed
  • 4 failures are new
  • 255 tests were quarantined / skipped
  • 7 minutes taken in total.
New test failures 4
Status Test Duration
Collapse Failed RmiOutboundGatewayTests failedMessage() History
< 1 sec
java.lang.ClassCastException: java.lang.ClassCastException: org.springframework.remoting.RemoteLookupFailureException cannot be cast to org.springframework.messaging.MessagingException
java.lang.ClassCastException: org.springframework.remoting.RemoteLookupFailureException cannot be cast to org.springframework.messaging.MessagingException
	at org.springframework.integration.rmi.RmiOutboundGatewayTests.lambda$failedMessage$1(RmiOutboundGatewayTests.java:89)
	at org.assertj.core.api.AbstractAssert.satisfies(AbstractAssert.java:682)
	at org.springframework.integration.rmi.RmiOutboundGatewayTests.failedMessage(RmiOutboundGatewayTests.java:87)
	at sun.reflect.NativeMethodAccessorImpl.invoke0(Native Method)
	at sun.reflect.NativeMethodAccessorImpl.invoke(NativeMethodAccessorImpl.java:62)
	at sun.reflect.DelegatingMethodAccessorImpl.invoke(DelegatingMethodAccessorImpl.java:43)
(85 more lines...)
Collapse Failed RmiOutboundGatewayTests nonSerializableAttribute() History
< 1 sec
org.springframework.messaging.MessageHandlingException: org.springframework.messaging.MessageHandlingException: Remote failure in the [org.springframework.integration.rmi.RmiOutboundGateway@2f46b093]; nested exception is org.springframework.remoting.RemoteLookupFailureException: Could not find RMI service [rmi://localhost:1099/testRemoteHandler] in RMI registry; nested exception is java.rmi.NotBoundException: testRemoteHandler, failedMessage=GenericMessage [payload=test, headers={testAttribute=org.springframework.integration.rmi.RmiOutboundGatewayTests$NonSerializableTestObject@3baedfb7, id=f4b5e2cd-f0ca-3190-7992-599e628f6a15, timestamp=1566246093575}]
org.springframework.messaging.MessageHandlingException: Remote failure in the [org.springframework.integration.rmi.RmiOutboundGateway@2f46b093]; nested exception is org.springframework.remoting.RemoteLookupFailureException: Could not find RMI service [rmi://localhost:1099/testRemoteHandler] in RMI registry; nested exception is java.rmi.NotBoundException: testRemoteHandler, failedMessage=GenericMessage [payload=test, headers={testAttribute=org.springframework.integration.rmi.RmiOutboundGatewayTests$NonSerializableTestObject@3baedfb7, id=f4b5e2cd-f0ca-3190-7992-599e628f6a15, timestamp=1566246093575}]
	at org.springframework.integration.rmi.RmiOutboundGateway.handleRequestMessage(RmiOutboundGateway.java:84)
	at org.springframework.integration.handler.AbstractReplyProducingMessageHandler.handleMessageInternal(AbstractReplyProducingMessageHandler.java:127)
	at org.springframework.integration.handler.AbstractMessageHandler.handleMessage(AbstractMessageHandler.java:177)
	at org.springframework.integration.rmi.RmiOutboundGatewayTests.nonSerializableAttribute(RmiOutboundGatewayTests.java:115)
	at sun.reflect.NativeMethodAccessorImpl.invoke0(Native Method)
	at sun.reflect.NativeMethodAccessorImpl.invoke(NativeMethodAccessorImpl.java:62)
(119 more lines...)
Collapse Failed RmiOutboundGatewayTests serializableAttribute() History
< 1 sec
org.springframework.messaging.MessageHandlingException: org.springframework.messaging.MessageHandlingException: Remote failure in the [org.springframework.integration.rmi.RmiOutboundGateway@2f46b093]; nested exception is org.springframework.remoting.RemoteLookupFailureException: Could not find RMI service [rmi://localhost:1099/testRemoteHandler] in RMI registry; nested exception is java.rmi.NotBoundException: testRemoteHandler, failedMessage=GenericMessage [payload=test, headers={testAttribute=foo, id=7752b3e4-b564-f074-be3a-dc3c32649980, timestamp=1566246093597}]
org.springframework.messaging.MessageHandlingException: Remote failure in the [org.springframework.integration.rmi.RmiOutboundGateway@2f46b093]; nested exception is org.springframework.remoting.RemoteLookupFailureException: Could not find RMI service [rmi://localhost:1099/testRemoteHandler] in RMI registry; nested exception is java.rmi.NotBoundException: testRemoteHandler, failedMessage=GenericMessage [payload=test, headers={testAttribute=foo, id=7752b3e4-b564-f074-be3a-dc3c32649980, timestamp=1566246093597}]
	at org.springframework.integration.rmi.RmiOutboundGateway.handleRequestMessage(RmiOutboundGateway.java:84)
	at org.springframework.integration.handler.AbstractReplyProducingMessageHandler.handleMessageInternal(AbstractReplyProducingMessageHandler.java:127)
	at org.springframework.integration.handler.AbstractMessageHandler.handleMessage(AbstractMessageHandler.java:177)
	at org.springframework.integration.rmi.RmiOutboundGatewayTests.serializableAttribute(RmiOutboundGatewayTests.java:97)
	at sun.reflect.NativeMethodAccessorImpl.invoke0(Native Method)
	at sun.reflect.NativeMethodAccessorImpl.invoke(NativeMethodAccessorImpl.java:62)
(119 more lines...)
Collapse Failed RmiOutboundGatewayTests serializablePayload() History
< 1 sec
org.springframework.messaging.MessageHandlingException: org.springframework.messaging.MessageHandlingException: Remote failure in the [org.springframework.integration.rmi.RmiOutboundGateway@2f46b093]; nested exception is org.springframework.remoting.RemoteLookupFailureException: Could not find RMI service [rmi://localhost:1099/testRemoteHandler] in RMI registry; nested exception is java.rmi.NotBoundException: testRemoteHandler, failedMessage=GenericMessage [payload=test, headers={id=379459b7-2d67-df1b-91e3-8bef4a5ba42f, timestamp=1566246093532}]
org.springframework.messaging.MessageHandlingException: Remote failure in the [org.springframework.integration.rmi.RmiOutboundGateway@2f46b093]; nested exception is org.springframework.remoting.RemoteLookupFailureException: Could not find RMI service [rmi://localhost:1099/testRemoteHandler] in RMI registry; nested exception is java.rmi.NotBoundException: testRemoteHandler, failedMessage=GenericMessage [payload=test, headers={id=379459b7-2d67-df1b-91e3-8bef4a5ba42f, timestamp=1566246093532}]
	at org.springframework.integration.rmi.RmiOutboundGateway.handleRequestMessage(RmiOutboundGateway.java:84)
	at org.springframework.integration.handler.AbstractReplyProducingMessageHandler.handleMessageInternal(AbstractReplyProducingMessageHandler.java:127)
	at org.springframework.integration.handler.AbstractMessageHandler.handleMessage(AbstractMessageHandler.java:177)
	at org.springframework.integration.rmi.RmiOutboundGatewayTests.serializablePayload(RmiOutboundGatewayTests.java:75)
	at sun.reflect.NativeMethodAccessorImpl.invoke0(Native Method)
	at sun.reflect.NativeMethodAccessorImpl.invoke(NativeMethodAccessorImpl.java:62)
(119 more lines...)

Error summary

The build generated some errors. See the full build log for more details.

*** java.lang.instrument ASSERTION FAILED ***: "!errorOutstanding" with message transform method call failed at JPLISAgent.c line: 844
*** java.lang.instrument ASSERTION FAILED ***: "!errorOutstanding" with message transform method call failed at JPLISAgent.c line: 844
*** java.lang.instrument ASSERTION FAILED ***: "!errorOutstanding" with message transform method call failed at JPLISAgent.c line: 844
javadoc: warning - Multiple sources of package comments found for package "javax.servlet"
javadoc: warning - Multiple sources of package comments found for package "javax.servlet.http"
javadoc: warning - Multiple sources of package comments found for package "javax.servlet.annotation"

23 tests completed, 4 failed

FAILURE: Build failed with an exception.

* What went wrong:
Execution failed for task ':spring-integration-rmi:test'.
> There were failing tests. See the report at: file:///opt/bamboo-home/xml-data/build-dir/INT-MASTER-JOB1/spring-integration-rmi/build/reports/tests/test/index.html

* Try:
Run with --stacktrace option to get the stack trace. Run with --info or --debug option to get more log output. Run with --scan to get full insights.

* Get more help at https://help.gradle.org

BUILD FAILED in 6m 40s