spring-projects/spring-integration master branch

Build: #1694 failed

Job: Default Job failed

Stages & jobs

  1. Default Stage

Job result summary

Completed
Duration
3 minutes
Agent
bamboo-24.af.pivotal.io
Revision
62d472f679c6dba9b0810bc8b5ef20d0cccc329c 62d472f679c6dba9b0810bc8b5ef20d0cccc329c
Total tests
2627
Fixed in
#1695 (Code changes detected)

Tests

  • 2,627 tests in total
  • 1 test failed
  • 1 failure is new
  • 49 tests were quarantined / skipped
  • 1 minute taken in total.
New test failures 1
Status Test Duration
Collapse Failed AmqpTests testAmqpOutboundFlow() History
1 sec
java.lang.AssertionError: java.lang.AssertionError: 
Expecting actual not to be null
java.lang.AssertionError: 
Expecting actual not to be null
	at org.springframework.integration.amqp.dsl.AmqpTests.testAmqpOutboundFlow(AmqpTests.java:150)
	at sun.reflect.NativeMethodAccessorImpl.invoke0(Native Method)
	at sun.reflect.NativeMethodAccessorImpl.invoke(NativeMethodAccessorImpl.java:62)
	at sun.reflect.DelegatingMethodAccessorImpl.invoke(DelegatingMethodAccessorImpl.java:43)
(85 more lines...)

Error summary

The build generated some errors. See the full build log for more details.


95 tests completed, 1 failed
*** java.lang.instrument ASSERTION FAILED ***: "!errorOutstanding" with message transform method call failed at JPLISAgent.c line: 844
*** java.lang.instrument ASSERTION FAILED ***: "!errorOutstanding" with message transform method call failed at JPLISAgent.c line: 844
*** java.lang.instrument ASSERTION FAILED ***: "!errorOutstanding" with message transform method call failed at JPLISAgent.c line: 844
*** java.lang.instrument ASSERTION FAILED ***: "!errorOutstanding" with message transform method call failed at JPLISAgent.c line: 844

FAILURE: Build failed with an exception.

* What went wrong:
Execution failed for task ':spring-integration-amqp:test'.
> There were failing tests. See the report at: file:///opt/bamboo-home/xml-data/build-dir/INT-MASTER-JOB1/spring-integration-amqp/build/reports/tests/test/index.html

* Try:
Run with --stacktrace option to get the stack trace. Run with --info or --debug option to get more log output. Run with --scan to get full insights.

* Get more help at https://help.gradle.org

BUILD FAILED in 3m 37s