spring-projects/spring-integration master branch

Build: #1722 failed

Job: Default Job failed

Stages & jobs

  1. Default Stage

Job result summary

Completed
Duration
4 minutes
Agent
bamboo-20.af.pivotal.io
Revision
185d370415252dce9c3075f7242fdc804afc2592 185d370415252dce9c3075f7242fdc804afc2592
Total tests
2777
Fixed in
#1723 (Code changes detected)

Tests

  • 2,777 tests in total
  • 1 test failed
  • 1 failure is new
  • 55 tests were quarantined / skipped
  • 2 minutes taken in total.
New test failures 1
Status Test Duration
Collapse Failed FtpServerOutboundTests allEvents History
< 1 sec
java.lang.AssertionError: java.lang.AssertionError: 
Expected size:<11> but was:<12> in:
<[SessionOpenedEvent [clientAddress=/127.0.0.1:48910],
    DirectoryCreatedEvent [request=MKD /ftpTarget/allEventsDir, clientAddress=/127.0.0.1:48910],
    FileWrittenEvent [append=false, request=STOR /ftpTarget/allEventsDir/file.txt, clientAddress=/127.0.0.1:48910],
    FileWrittenEvent [append=false, request=APPE /ftpTarget/allEventsDir/file.txt, clientAddress=/127.0.0.1:48910],
    PathRemovedEvent [isDirectory=false, request=DELE /ftpTarget/allEventsDir/file2.txt, clientAddress=/127.0.0.1:48910],
    PathMovedEvent [request=RNTO /ftpTarget/allEventsDir/file2.txt, clientAddress=/127.0.0.1:48910],
(105 more lines...)

Error summary

The build generated some errors. See the full build log for more details.

/opt/bamboo-home/xml-data/build-dir/INT-MASTER-JOB1/spring-integration-webflux/src/main/java/org/springframework/integration/webflux/outbound/WebFluxRequestExecutingMessageHandler.java:317: warning: [deprecation] <T>fromObject(T) in BodyInserters has been deprecated
                        inserter = BodyInserters.fromObject(requestBody);
                                                ^
  where T is a type-variable:
    T extends Object declared in method <T>fromObject(T)
1 warning

81 tests completed, 1 failed, 4 skipped
*** java.lang.instrument ASSERTION FAILED ***: "!errorOutstanding" with message transform method call failed at JPLISAgent.c line: 844
*** java.lang.instrument ASSERTION FAILED ***: "!errorOutstanding" with message transform method call failed at JPLISAgent.c line: 844
*** java.lang.instrument ASSERTION FAILED ***: "!errorOutstanding" with message transform method call failed at JPLISAgent.c line: 844
javadoc: warning - Multiple sources of package comments found for package "javax.servlet"
javadoc: warning - Multiple sources of package comments found for package "javax.servlet.http"
javadoc: warning - Multiple sources of package comments found for package "javax.servlet.annotation"

FAILURE: Build failed with an exception.

* What went wrong:
Execution failed for task ':spring-integration-ftp:test'.
> There were failing tests. See the report at: file:///opt/bamboo-home/xml-data/build-dir/INT-MASTER-JOB1/spring-integration-ftp/build/reports/tests/test/index.html

* Try:
Run with --stacktrace option to get the stack trace. Run with --info or --debug option to get more log output. Run with --scan to get full insights.

* Get more help at https://help.gradle.org

BUILD FAILED in 4m 29s