spring-projects/spring-integration master branch

Build: #1726 failed

Job: Default Job failed

Stages & jobs

  1. Default Stage

Job result summary

Completed
Duration
3 minutes
Agent
bamboo-22.af.pivotal.io
Revision
87840bcfe48bc20e916e2158a5ed3a3f55c617b8 87840bcfe48bc20e916e2158a5ed3a3f55c617b8
Total tests
132
Fixed in
#1728 (Code changes detected)
No failed tests found, a possible compilation error occurred.

Tests

  • 132 tests in total
  • 1 test was quarantined / skipped
  • 31 seconds taken in total.

Error summary

The build generated some errors. See the full build log for more details.

[ant:checkstyle] [ERROR] /opt/bamboo-home/xml-data/build-dir/INT-MASTER-JOB1/spring-integration-core/src/test/java/org/springframework/integration/support/management/graph/IntegrationGraphServerTests.java:78: Extra separation in import group before 'io.micrometer.core.instrument.MeterRegistry' [ImportOrder]

FAILURE: Build failed with an exception.

* What went wrong:
Execution failed for task ':spring-integration-core:checkstyleTest'.
> Checkstyle rule violations were found. See the report at: file:///opt/bamboo-home/xml-data/build-dir/INT-MASTER-JOB1/spring-integration-core/build/reports/checkstyle/test.html
  Checkstyle files with violations: 1
  Checkstyle violations by severity: [error:1]


* Try:
Run with --stacktrace option to get the stack trace. Run with --info or --debug option to get more log output. Run with --scan to get full insights.

* Get more help at https://help.gradle.org

BUILD FAILED in 3m 16s